null
SMILES: CSc1ccc(NC(=O)Nc2c(C)n(C)n(-c3ccccc3)c2=O)cc1
InChI Key: InChIKey=JIGMZPONXCJZIR-UHFFFAOYSA-N
Activity Spreadsheet -- Enzyme Inhibition Constant Data from BindingDB
Found 1 hit for monomerid = 50186955
Trg + Lig
Ki
nM
ΔG°
kcal/mole
IC50
nM
Kd
nM
EC50/IC50
nM
koff
s-1
kon
M-1s-1
pHTemp
°C
N-formyl peptide receptor 2
(Homo sapiens (Human))
BDBM50186955
(1-(2,3-dimethyl-5-oxo-1-phenyl-2,5-dihydro-1H-pyra...)
Show SMILES CSc1ccc(NC(=O)Nc2c(C)n(C)n(-c3ccccc3)c2=O)cc1
Show InChI InChI=1S/C19H20N4O2S/c1-13-17(18(24)23(22(13)2)15-7-5-4-6-8-15)21-19(25)20-14-9-11-16(26-3)12-10-14/h4-12H,1-3H3,(H2,20,21,25)
NCI pathway
Reactome pathway
n/an/an/an/a 170n/an/an/an/a
Amgen, Inc.
Curated by ChEMBL
Assay Description
Activity at human FPRL1-mediated calcium mobilization in CHO cells
Bioorg Med Chem Lett 16: 3713-8 (2006)
Article DOI: 10.1016/j.bmcl.2006.04.068
BindingDB Entry DOI: 10.7270/Q2DF6QTJ