BDBM50186966 1-(2,3-dimethyl-5-oxo-1-phenyl-2,5-dihydro-1H-pyrazol-4-yl)-3-(thiazol-2-yl)urea::CHEMBL208979
SMILES: Cc1c(NC(=O)Nc2nccs2)c(=O)n(-c2ccccc2)n1C
InChI Key: InChIKey=PMMHYESTCYXXQM-UHFFFAOYSA-N
Data: 1 EC50
Activity Spreadsheet -- Enzyme Inhibition Constant Data from BindingDB
Found 1 hit for monomerid = 50186966
Trg + Lig
Ki
nM
ΔG°
kcal/mole
IC50
nM
Kd
nM
EC50/IC50
nM
koff
s-1
kon
M-1s-1
pHTemp
°C
N-formyl peptide receptor 2
(Homo sapiens (Human))
BDBM50186966
(1-(2,3-dimethyl-5-oxo-1-phenyl-2,5-dihydro-1H-pyra...)
Show SMILES Cc1c(NC(=O)Nc2nccs2)c(=O)n(-c2ccccc2)n1C
Show InChI InChI=1S/C15H15N5O2S/c1-10-12(17-14(22)18-15-16-8-9-23-15)13(21)20(19(10)2)11-6-4-3-5-7-11/h3-9H,1-2H3,(H2,16,17,18,22)
NCI pathway
Reactome pathway
n/an/an/an/a>1.00E+4n/an/an/an/a
Amgen, Inc.
Curated by ChEMBL
Assay Description
Activity at human FPRL1-mediated calcium mobilization in CHO cells
Bioorg Med Chem Lett 16: 3713-8 (2006)
Article DOI: 10.1016/j.bmcl.2006.04.068
BindingDB Entry DOI: 10.7270/Q2DF6QTJ