BDBM50187007 5-chloro-3-(3,4-dioxo-2-(phenylamino)cyclobut-1-enylamino)-2-hydroxy-N,N-dimethylbenzamide::CHEMBL387431
SMILES: CN(C)C(=O)c1cc(Cl)cc(Nc2c(Nc3ccccc3)c(=O)c2=O)c1O
InChI Key: InChIKey=JMUNTWLFBDHKSN-UHFFFAOYSA-N
Data: 1 IC50
Activity Spreadsheet -- Enzyme Inhibition Constant Data from BindingDB
Found 1 hit for monomerid = 50187007
Trg + Lig
Ki
nM
ΔG°
kcal/mole
IC50
nM
Kd
nM
EC50/IC50
nM
koff
s-1
kon
M-1s-1
pHTemp
°C
C-X-C chemokine receptor type 2
(Homo sapiens (Human))
BDBM50187007
(5-chloro-3-(3,4-dioxo-2-(phenylamino)cyclobut-1-en...)
Show SMILES CN(C)C(=O)c1cc(Cl)cc(Nc2c(Nc3ccccc3)c(=O)c2=O)c1O
Show InChI InChI=1S/C19H16ClN3O4/c1-23(2)19(27)12-8-10(20)9-13(16(12)24)22-15-14(17(25)18(15)26)21-11-6-4-3-5-7-11/h3-9,21-22,24H,1-2H3
Reactome pathway
n/an/a 2n/an/an/an/an/an/a
Pharmacopeia Drug Discovery, Inc.
Curated by ChEMBL
Assay Description
Displacement of [125I]IL8 from human CXCR2 expressed in CHO cells
Bioorg Med Chem Lett 16: 4107-10 (2006)
Article DOI: 10.1016/j.bmcl.2006.04.082
BindingDB Entry DOI: 10.7270/Q24X57DB