BDBM50187208 CHEMBL3827386
SMILES: CN1CCC(CC1)OC1c2ccccc2Oc2ccccc12
InChI Key: InChIKey=YGPKIRKMSLOYIP-UHFFFAOYSA-N
Data: 1 IC50
Activity Spreadsheet -- Enzyme Inhibition Constant Data from BindingDB
Found 1 hit for monomerid = 50187208
Trg + Lig
Ki
nM
ΔG°
kcal/mole
IC50
nM
Kd
nM
EC50/IC50
nM
koff
s-1
kon
M-1s-1
pHTemp
°C
SET domain-containing protein 7/9 (Set7/9)
(Homo sapiens (Human))
BDBM50187208
(CHEMBL3827386)
Show SMILES CN1CCC(CC1)OC1c2ccccc2Oc2ccccc12
Show InChI InChI=1S/C19H21NO2/c1-20-12-10-14(11-13-20)21-19-15-6-2-4-8-17(15)22-18-9-5-3-7-16(18)19/h2-9,14,19H,10-13H2,1H3
n/an/a>1.00E+5n/an/an/an/an/an/a
Tokyo Medical and Dental University (TMDU)
Curated by ChEMBL
Assay Description
Inhibition of recombinant SET7/9 (unknown origin) using biotinylated histone H3-derived peptide/SAM as substrate after 60 mins by AlphaLISA assay
Bioorg Med Chem 24: 4318-4323 (2016)
BindingDB Entry DOI: 10.7270/Q2959KGV