BDBM50187223 (S)-1-(2-aminophenylsulfonyl)pyrrolidine-2-carboxylic acid::CHEMBL208343
SMILES: Nc1ccccc1S(=O)(=O)N1CCC[C@H]1C(O)=O
InChI Key: InChIKey=NDUWGSUQOMWHAL-VIFPVBQESA-N
Data: 1 IC50
Activity Spreadsheet -- Enzyme Inhibition Constant Data from BindingDB
Found 1 hit for monomerid = 50187223
Trg + Lig
Ki
nM
ΔG°
kcal/mole
IC50
nM
Kd
nM
EC50/IC50
nM
koff
s-1
kon
M-1s-1
pHTemp
°C
Hepatitis C virus NS5B RNA-dependent RNA polymerase
(Hepatitis C virus)
BDBM50187223
((S)-1-(2-aminophenylsulfonyl)pyrrolidine-2-carboxy...)
Show SMILES Nc1ccccc1S(=O)(=O)N1CCC[C@H]1C(O)=O
Show InChI InChI=1S/C11H14N2O4S/c12-8-4-1-2-6-10(8)18(16,17)13-7-3-5-9(13)11(14)15/h1-2,4,6,9H,3,5,7,12H2,(H,14,15)/t9-/m0/s1
n/an/a>2.00E+4n/an/an/an/an/an/a
Wyeth Research
Curated by ChEMBL
Assay Description
Inhibition of HCV NS5B RNA dependent RNA polymerase
J Med Chem 49: 3052-5 (2006)
Article DOI: 10.1021/jm060168g
BindingDB Entry DOI: 10.7270/Q2M04517