BDBM50187383 CHEMBL207478::N-[3-(4-{4-[methyl-(2-methyl-propane-1-sulfonyl)-amino]-butyl}-piperazin-1-yl)-phenyl]-acetamide
SMILES: CC(C)CS(=O)(=O)N(C)CCCCN1CCN(CC1)c1cccc(NC(C)=O)c1
InChI Key: InChIKey=RSYFEHSGTZNRPM-UHFFFAOYSA-N
Data: 1 KI  1 IC50  1 EC50
Activity Spreadsheet -- Enzyme Inhibition Constant Data from BindingDB
Found 3 hits for monomerid = 50187383
Trg + Lig
Ki
nM
ΔG°
kcal/mole
IC50
nM
Kd
nM
EC50/IC50
nM
koff
s-1
kon
M-1s-1
pHTemp
°C
5-hydroxytryptamine receptor 1A
(Homo sapiens (Human))
BDBM50187383
(CHEMBL207478 | N-[3-(4-{4-[methyl-(2-methyl-propan...)
Show SMILES CC(C)CS(=O)(=O)N(C)CCCCN1CCN(CC1)c1cccc(NC(C)=O)c1
Show InChI InChI=1S/C21H36N4O3S/c1-18(2)17-29(27,28)23(4)10-5-6-11-24-12-14-25(15-13-24)21-9-7-8-20(16-21)22-19(3)26/h7-9,16,18H,5-6,10-15,17H2,1-4H3,(H,22,26)
9.70n/an/an/an/an/an/an/an/a
Predix Pharmaceuticals Ltd.
Curated by ChEMBL
Assay Description
Displacement of [3H]8-OH-DPAT from human 5HT1A receptor in HEK293 cells
J Med Chem 49: 3116-35 (2006)
Article DOI: 10.1021/jm0508641
BindingDB Entry DOI: 10.7270/Q2319VHC
5-hydroxytryptamine receptor 1A
(Homo sapiens (Human))
BDBM50187383
(CHEMBL207478 | N-[3-(4-{4-[methyl-(2-methyl-propan...)
Show SMILES CC(C)CS(=O)(=O)N(C)CCCCN1CCN(CC1)c1cccc(NC(C)=O)c1
Show InChI InChI=1S/C21H36N4O3S/c1-18(2)17-29(27,28)23(4)10-5-6-11-24-12-14-25(15-13-24)21-9-7-8-20(16-21)22-19(3)26/h7-9,16,18H,5-6,10-15,17H2,1-4H3,(H,22,26)
n/an/an/an/a 32n/an/an/an/a
Predix Pharmaceuticals Ltd.
Curated by ChEMBL
Assay Description
Activity against 5HT1A receptor by Gi-[35S]GTPgammaS binding assay
J Med Chem 49: 3116-35 (2006)
Article DOI: 10.1021/jm0508641
BindingDB Entry DOI: 10.7270/Q2319VHC
Potassium voltage-gated channel subfamily H member 2
(Homo sapiens (Human))
BDBM50187383
(CHEMBL207478 | N-[3-(4-{4-[methyl-(2-methyl-propan...)
Show SMILES CC(C)CS(=O)(=O)N(C)CCCCN1CCN(CC1)c1cccc(NC(C)=O)c1
Show InChI InChI=1S/C21H36N4O3S/c1-18(2)17-29(27,28)23(4)10-5-6-11-24-12-14-25(15-13-24)21-9-7-8-20(16-21)22-19(3)26/h7-9,16,18H,5-6,10-15,17H2,1-4H3,(H,22,26)
Reactome pathway
n/an/a 2.20E+3n/an/an/an/an/an/a
Predix Pharmaceuticals Ltd.
Curated by ChEMBL
Assay Description
Inhibition of hERG potassium channel in HEK293 cells by patch clamp assay
J Med Chem 49: 3116-35 (2006)
Article DOI: 10.1021/jm0508641
BindingDB Entry DOI: 10.7270/Q2319VHC