BDBM50187459 5-(1,4-diazepan-1-yl)-2-iodopyridin-3-ol::5-[1,4]-diazepan-1-yl-2-iodo-pyridin-3-ol::CHEMBL208814
SMILES: Oc1cc(cnc1I)N1CCCNCC1
InChI Key: InChIKey=HMSUQCBFNZLLMB-UHFFFAOYSA-N
Data: 2 IC50  1 EC50
Activity Spreadsheet -- Enzyme Inhibition Constant Data from BindingDB
Found 3 hits for monomerid = 50187459
Trg + Lig
Ki
nM
ΔG°
kcal/mole
IC50
nM
Kd
nM
EC50/IC50
nM
koff
s-1
kon
M-1s-1
pHTemp
°C
Neuronal acetylcholine receptor subunit alpha-4
(Homo sapiens (Human))
BDBM50187459
(5-(1,4-diazepan-1-yl)-2-iodopyridin-3-ol | 5-[1,4]...)
Show SMILES Oc1cc(cnc1I)N1CCCNCC1
Show InChI InChI=1S/C10H14IN3O/c11-10-9(15)6-8(7-13-10)14-4-1-2-12-3-5-14/h6-7,12,15H,1-5H2
n/an/a 21.9n/an/an/an/an/an/a
University of Turin
Curated by ChEMBL
Assay Description
Displacement of [3H]cytisine from human alpha4beta2 nAChR expressed in HEK293 cells
J Med Chem 52: 2311-6 (2009)
Article DOI: 10.1021/jm801060h
BindingDB Entry DOI: 10.7270/Q2XK8GS0
Neuronal acetylcholine receptor protein alpha-4/beta-2 subunit
(Rattus norvegicus (Rat))
BDBM50187459
(5-(1,4-diazepan-1-yl)-2-iodopyridin-3-ol | 5-[1,4]...)
Show SMILES Oc1cc(cnc1I)N1CCCNCC1
Show InChI InChI=1S/C10H14IN3O/c11-10-9(15)6-8(7-13-10)14-4-1-2-12-3-5-14/h6-7,12,15H,1-5H2
n/an/a 22n/an/an/an/an/an/a
NeuroSearch A/S
Curated by ChEMBL
Assay Description
Inhibition of [3H]cytisine binding to alpha4beta2 nACHR in Wistar rat cerebral cortical membrane
J Med Chem 49: 3159-71 (2006)
Article DOI: 10.1021/jm058058h
BindingDB Entry DOI: 10.7270/Q2C53PM7
Neuronal acetylcholine receptor subunit alpha-4
(Homo sapiens (Human))
BDBM50187459
(5-(1,4-diazepan-1-yl)-2-iodopyridin-3-ol | 5-[1,4]...)
Show SMILES Oc1cc(cnc1I)N1CCCNCC1
Show InChI InChI=1S/C10H14IN3O/c11-10-9(15)6-8(7-13-10)14-4-1-2-12-3-5-14/h6-7,12,15H,1-5H2
n/an/an/an/a 479n/an/an/an/a
University of Turin
Curated by ChEMBL
Assay Description
Agonist activity at human alpha4beta2 nAChR expressed in HEK293 cells assessed as intracellular calcium level by FLIPR assay
J Med Chem 52: 2311-6 (2009)
Article DOI: 10.1021/jm801060h
BindingDB Entry DOI: 10.7270/Q2XK8GS0