null
SMILES: CN1\C(=C\C=C2/CCCC(\C=C\C3=[N+](CCCCCC(=O)NCCCCC(NC(=O)CCCCCCC(=O)NCCCCC(NC(=O)NC(CCC(O)=O)C(O)=O)C(O)=O)C(=O)NCc4ccc(cc4)-c4ccc(O)c(c4)-c4cc5cc(ccc5[nH]4)C(=N)\N=C(\C)O)c4ccc(cc4C3(C)C)S([O-])(=O)=O)=C2)C(C)(C)c2cc(ccc12)S([O-])(=O)=O
InChI Key:
Activity Spreadsheet -- Enzyme Inhibition Constant Data from BindingDB
Found 1 hit for monomerid = 50187704
Trg + Lig
Ki
nM
ΔG°
kcal/mole
IC50
nM
Kd
nM
EC50/IC50
nM
koff
s-1
kon
M-1s-1
pHTemp
°C
Glutamate carboxypeptidase 2
(Homo sapiens (Human))
BDBM50187704
(CHEMBL3828024)
Show SMILES CN1\C(=C\C=C2/CCCC(\C=C\C3=[N+](CCCCCC(=O)NCCCCC(NC(=O)CCCCCCC(=O)NCCCCC(NC(=O)NC(CCC(O)=O)C(O)=O)C(O)=O)C(=O)NCc4ccc(cc4)-c4ccc(O)c(c4)-c4cc5cc(ccc5[nH]4)C(=N)\N=C(\C)O)c4ccc(cc4C3(C)C)S([O-])(=O)=O)=C2)C(C)(C)c2cc(ccc12)S([O-])(=O)=O |c:12,110|
n/an/a 25n/an/an/an/an/an/a
Korea University
Curated by ChEMBL
Assay Description
Inhibition of PSMA (unknown origin) assessed as reduction in glutamate formation using NAAG as substrate preincubated for 30 mins followed by substra...
Eur J Med Chem 118: 208-218 (2016)
BindingDB Entry DOI: 10.7270/Q2TX3HB6