BDBM50187785 4-((4-(but-2-ynyloxy)phenylsulfonyl)methyl)-1-(4-(dimethylamino)butanoyl)-N-hydroxypiperidine-4-carboxamide::CHEMBL425783
SMILES: CC#CCOc1ccc(cc1)S(=O)(=O)CC1(CCN(CC1)C(=O)CCCN(C)C)C(=O)NO
InChI Key: InChIKey=KSOLTKWEALJMDR-UHFFFAOYSA-N
Data: 6 IC50
Activity Spreadsheet -- Enzyme Inhibition Constant Data from BindingDB
Found 6 hits for monomerid = 50187785
Trg + Lig
Ki
nM
ΔG°
kcal/mole
IC50
nM
Kd
nM
EC50/IC50
nM
koff
s-1
kon
M-1s-1
pHTemp
°C
Matrix metalloproteinase-14 (MMP14)
(Homo sapiens (Human))
BDBM50187785
(4-((4-(but-2-ynyloxy)phenylsulfonyl)methyl)-1-(4-(...)
Show SMILES CC#CCOc1ccc(cc1)S(=O)(=O)CC1(CCN(CC1)C(=O)CCCN(C)C)C(=O)NO
Show InChI InChI=1S/C23H33N3O6S/c1-4-5-17-32-19-8-10-20(11-9-19)33(30,31)18-23(22(28)24-29)12-15-26(16-13-23)21(27)7-6-14-25(2)3/h8-11,29H,6-7,12-18H2,1-3H3,(H,24,28)
n/an/a 2.74E+3n/an/an/an/an/an/a
Wyeth Research
Curated by ChEMBL
Assay Description
Inhibition of MMP14
Bioorg Med Chem Lett 16: 3927-31 (2006)
Article DOI: 10.1016/j.bmcl.2006.05.026
BindingDB Entry DOI: 10.7270/Q2222TCJ
Matrix metalloproteinase-9
(Homo sapiens (Human))
BDBM50187785
(4-((4-(but-2-ynyloxy)phenylsulfonyl)methyl)-1-(4-(...)
Show SMILES CC#CCOc1ccc(cc1)S(=O)(=O)CC1(CCN(CC1)C(=O)CCCN(C)C)C(=O)NO
Show InChI InChI=1S/C23H33N3O6S/c1-4-5-17-32-19-8-10-20(11-9-19)33(30,31)18-23(22(28)24-29)12-15-26(16-13-23)21(27)7-6-14-25(2)3/h8-11,29H,6-7,12-18H2,1-3H3,(H,24,28)
Reactome pathway
n/an/a 2.12E+3n/an/an/an/an/an/a
Wyeth Research
Curated by ChEMBL
Assay Description
Inhibition of MMP9
Bioorg Med Chem Lett 16: 3927-31 (2006)
Article DOI: 10.1016/j.bmcl.2006.05.026
BindingDB Entry DOI: 10.7270/Q2222TCJ
Interstitial collagenase
(Homo sapiens (Human))
BDBM50187785
(4-((4-(but-2-ynyloxy)phenylsulfonyl)methyl)-1-(4-(...)
Show SMILES CC#CCOc1ccc(cc1)S(=O)(=O)CC1(CCN(CC1)C(=O)CCCN(C)C)C(=O)NO
Show InChI InChI=1S/C23H33N3O6S/c1-4-5-17-32-19-8-10-20(11-9-19)33(30,31)18-23(22(28)24-29)12-15-26(16-13-23)21(27)7-6-14-25(2)3/h8-11,29H,6-7,12-18H2,1-3H3,(H,24,28)
Reactome pathway
n/an/a 7.97E+3n/an/an/an/an/an/a
Wyeth Research
Curated by ChEMBL
Assay Description
Inhibition of MMP1
Bioorg Med Chem Lett 16: 3927-31 (2006)
Article DOI: 10.1016/j.bmcl.2006.05.026
BindingDB Entry DOI: 10.7270/Q2222TCJ
Disintegrin and metalloproteinase domain-containing protein 17
(Homo sapiens (Human))
BDBM50187785
(4-((4-(but-2-ynyloxy)phenylsulfonyl)methyl)-1-(4-(...)
Show SMILES CC#CCOc1ccc(cc1)S(=O)(=O)CC1(CCN(CC1)C(=O)CCCN(C)C)C(=O)NO
Show InChI InChI=1S/C23H33N3O6S/c1-4-5-17-32-19-8-10-20(11-9-19)33(30,31)18-23(22(28)24-29)12-15-26(16-13-23)21(27)7-6-14-25(2)3/h8-11,29H,6-7,12-18H2,1-3H3,(H,24,28)
Reactome pathway
n/an/a 4.90n/an/an/an/an/an/a
Wyeth Research
Curated by ChEMBL
Assay Description
Inhibition of TACE by FRET assay
Bioorg Med Chem Lett 16: 3927-31 (2006)
Article DOI: 10.1016/j.bmcl.2006.05.026
BindingDB Entry DOI: 10.7270/Q2222TCJ
Collagenase 3
(Homo sapiens (Human))
BDBM50187785
(4-((4-(but-2-ynyloxy)phenylsulfonyl)methyl)-1-(4-(...)
Show SMILES CC#CCOc1ccc(cc1)S(=O)(=O)CC1(CCN(CC1)C(=O)CCCN(C)C)C(=O)NO
Show InChI InChI=1S/C23H33N3O6S/c1-4-5-17-32-19-8-10-20(11-9-19)33(30,31)18-23(22(28)24-29)12-15-26(16-13-23)21(27)7-6-14-25(2)3/h8-11,29H,6-7,12-18H2,1-3H3,(H,24,28)
NCI pathway
Reactome pathway
n/an/a 177n/an/an/an/an/an/a
Wyeth Research
Curated by ChEMBL
Assay Description
Inhibition of MMP13
Bioorg Med Chem Lett 16: 3927-31 (2006)
Article DOI: 10.1016/j.bmcl.2006.05.026
BindingDB Entry DOI: 10.7270/Q2222TCJ
72 kDa type IV collagenase
(Homo sapiens (Human))
BDBM50187785
(4-((4-(but-2-ynyloxy)phenylsulfonyl)methyl)-1-(4-(...)
Show SMILES CC#CCOc1ccc(cc1)S(=O)(=O)CC1(CCN(CC1)C(=O)CCCN(C)C)C(=O)NO
Show InChI InChI=1S/C23H33N3O6S/c1-4-5-17-32-19-8-10-20(11-9-19)33(30,31)18-23(22(28)24-29)12-15-26(16-13-23)21(27)7-6-14-25(2)3/h8-11,29H,6-7,12-18H2,1-3H3,(H,24,28)
Reactome pathway
n/an/a 302n/an/an/an/an/an/a
Wyeth Research
Curated by ChEMBL
Assay Description
Inhibition of MMP2
Bioorg Med Chem Lett 16: 3927-31 (2006)
Article DOI: 10.1016/j.bmcl.2006.05.026
BindingDB Entry DOI: 10.7270/Q2222TCJ