BDBM50187793 4-((4-(but-2-ynyloxy)phenylsulfonyl)methyl)-N-hydroxy-1-(phenylsulfonyl)piperidine-4-carboxamide::CHEMBL214287
SMILES: CC#CCOc1ccc(cc1)S(=O)(=O)CC1(CCN(CC1)S(=O)(=O)c1ccccc1)C(=O)NO
InChI Key: InChIKey=JOYZIODFRIKBIG-UHFFFAOYSA-N
Data: 1 IC50
Activity Spreadsheet -- Enzyme Inhibition Constant Data from BindingDB
Found 1 hit for monomerid = 50187793
Trg + Lig
Ki
nM
ΔG°
kcal/mole
IC50
nM
Kd
nM
EC50/IC50
nM
koff
s-1
kon
M-1s-1
pHTemp
°C
Disintegrin and metalloproteinase domain-containing protein 17
(Homo sapiens (Human))
BDBM50187793
(4-((4-(but-2-ynyloxy)phenylsulfonyl)methyl)-N-hydr...)
Show SMILES CC#CCOc1ccc(cc1)S(=O)(=O)CC1(CCN(CC1)S(=O)(=O)c1ccccc1)C(=O)NO
Show InChI InChI=1S/C23H26N2O7S2/c1-2-3-17-32-19-9-11-20(12-10-19)33(28,29)18-23(22(26)24-27)13-15-25(16-14-23)34(30,31)21-7-5-4-6-8-21/h4-12,27H,13-18H2,1H3,(H,24,26)
Reactome pathway
n/an/a 2.5n/an/an/an/an/an/a
Wyeth Research
Curated by ChEMBL
Assay Description
Inhibition of TACE by FRET assay
Bioorg Med Chem Lett 16: 3927-31 (2006)
Article DOI: 10.1016/j.bmcl.2006.05.026
BindingDB Entry DOI: 10.7270/Q2222TCJ