BDBM50187971 (S)-9a-ethyl-6-(trifluoromethyl)-8,9,9a,10-tetrahydroindeno[2,1-e]indazol-7(3H)-one::CHEMBL208929
SMILES: CC[C@]12Cc3c(ccc4[nH]ncc34)C1=C(C(=O)CC2)C(F)(F)F
InChI Key: InChIKey=HIMQJMWVIJRMHV-INIZCTEOSA-N
Data: 2 IC50  2 EC50
Activity Spreadsheet -- Enzyme Inhibition Constant Data from BindingDB
Found 4 hits for monomerid = 50187971
Trg + Lig
Ki
nM
ΔG°
kcal/mole
IC50
nM
Kd
nM
EC50/IC50
nM
koff
s-1
kon
M-1s-1
pHTemp
°C
Estradiol receptor beta (ERβ)
(Homo sapiens (Human))
BDBM50187971
((S)-9a-ethyl-6-(trifluoromethyl)-8,9,9a,10-tetrahy...)
Show SMILES CC[C@]12Cc3c(ccc4[nH]ncc34)C1=C(C(=O)CC2)C(F)(F)F |c:16|
Show InChI InChI=1S/C17H15F3N2O/c1-2-16-6-5-13(23)15(17(18,19)20)14(16)9-3-4-12-11(8-21-22-12)10(9)7-16/h3-4,8H,2,5-7H2,1H3,(H,21,22)/t16-/m0/s1
n/an/a 2.80n/an/an/an/an/an/a
Merck Research Laboratories
Curated by ChEMBL
Assay Description
Binding affinity to human ERbeta
Bioorg Med Chem Lett 16: 3896-901 (2006)
Article DOI: 10.1016/j.bmcl.2006.05.036
BindingDB Entry DOI: 10.7270/Q24T6J01
Estrogen receptor
(Homo sapiens (Human))
BDBM50187971
((S)-9a-ethyl-6-(trifluoromethyl)-8,9,9a,10-tetrahy...)
Show SMILES CC[C@]12Cc3c(ccc4[nH]ncc34)C1=C(C(=O)CC2)C(F)(F)F |c:16|
Show InChI InChI=1S/C17H15F3N2O/c1-2-16-6-5-13(23)15(17(18,19)20)14(16)9-3-4-12-11(8-21-22-12)10(9)7-16/h3-4,8H,2,5-7H2,1H3,(H,21,22)/t16-/m0/s1
n/an/a 360n/an/an/an/an/an/a
Merck Research Laboratories
Curated by ChEMBL
Assay Description
Binding affinity to human ERalpha
Bioorg Med Chem Lett 16: 3896-901 (2006)
Article DOI: 10.1016/j.bmcl.2006.05.036
BindingDB Entry DOI: 10.7270/Q24T6J01
Estradiol receptor beta (ERβ)
(Homo sapiens (Human))
BDBM50187971
((S)-9a-ethyl-6-(trifluoromethyl)-8,9,9a,10-tetrahy...)
Show SMILES CC[C@]12Cc3c(ccc4[nH]ncc34)C1=C(C(=O)CC2)C(F)(F)F |c:16|
Show InChI InChI=1S/C17H15F3N2O/c1-2-16-6-5-13(23)15(17(18,19)20)14(16)9-3-4-12-11(8-21-22-12)10(9)7-16/h3-4,8H,2,5-7H2,1H3,(H,21,22)/t16-/m0/s1
n/an/an/an/a 0.600n/an/an/an/a
Merck Research Laboratories
Curated by ChEMBL
Assay Description
Agonist activity at human ERbeta transfected in HEK293 cells assessed as transactivation of alkaline phosphatase reporter gene
Bioorg Med Chem Lett 16: 3896-901 (2006)
Article DOI: 10.1016/j.bmcl.2006.05.036
BindingDB Entry DOI: 10.7270/Q24T6J01
Estrogen receptor
(Homo sapiens (Human))
BDBM50187971
((S)-9a-ethyl-6-(trifluoromethyl)-8,9,9a,10-tetrahy...)
Show SMILES CC[C@]12Cc3c(ccc4[nH]ncc34)C1=C(C(=O)CC2)C(F)(F)F |c:16|
Show InChI InChI=1S/C17H15F3N2O/c1-2-16-6-5-13(23)15(17(18,19)20)14(16)9-3-4-12-11(8-21-22-12)10(9)7-16/h3-4,8H,2,5-7H2,1H3,(H,21,22)/t16-/m0/s1
n/an/an/an/a 50n/an/an/an/a
Merck Research Laboratories
Curated by ChEMBL
Assay Description
Agonist activity at human ERalpha transfected in HEK293 cells assessed as transactivation of alkaline phosphatase reporter gene
Bioorg Med Chem Lett 16: 3896-901 (2006)
Article DOI: 10.1016/j.bmcl.2006.05.036
BindingDB Entry DOI: 10.7270/Q24T6J01