BDBM50187973 (S)-9a-butyl-6-ethyl-8,9,9a,10-tetrahydroindeno[2,1-e]indazol-7(3H)-one::CHEMBL211816
SMILES: CCCC[C@]12Cc3c(ccc4[nH]ncc34)C1=C(CC)C(=O)CC2
InChI Key: InChIKey=BRFOVRDNLUKMTR-FQEVSTJZSA-N
Data: 2 IC50
Activity Spreadsheet -- Enzyme Inhibition Constant Data from BindingDB
Found 2 hits for monomerid = 50187973
Trg + Lig
Ki
nM
ΔG°
kcal/mole
IC50
nM
Kd
nM
EC50/IC50
nM
koff
s-1
kon
M-1s-1
pHTemp
°C
Estradiol receptor beta (ERβ)
(Homo sapiens (Human))
BDBM50187973
((S)-9a-butyl-6-ethyl-8,9,9a,10-tetrahydroindeno[2,...)
Show SMILES CCCC[C@]12Cc3c(ccc4[nH]ncc34)C1=C(CC)C(=O)CC2 |t:18|
Show InChI InChI=1S/C20H24N2O/c1-3-5-9-20-10-8-18(23)13(4-2)19(20)14-6-7-17-16(12-21-22-17)15(14)11-20/h6-7,12H,3-5,8-11H2,1-2H3,(H,21,22)/t20-/m0/s1
n/an/a 1.10n/an/an/an/an/an/a
Merck Research Laboratories
Curated by ChEMBL
Assay Description
Binding affinity to human ERbeta
Bioorg Med Chem Lett 16: 3896-901 (2006)
Article DOI: 10.1016/j.bmcl.2006.05.036
BindingDB Entry DOI: 10.7270/Q24T6J01
Estrogen receptor
(Homo sapiens (Human))
BDBM50187973
((S)-9a-butyl-6-ethyl-8,9,9a,10-tetrahydroindeno[2,...)
Show SMILES CCCC[C@]12Cc3c(ccc4[nH]ncc34)C1=C(CC)C(=O)CC2 |t:18|
Show InChI InChI=1S/C20H24N2O/c1-3-5-9-20-10-8-18(23)13(4-2)19(20)14-6-7-17-16(12-21-22-17)15(14)11-20/h6-7,12H,3-5,8-11H2,1-2H3,(H,21,22)/t20-/m0/s1
n/an/a 93n/an/an/an/an/an/a
Merck Research Laboratories
Curated by ChEMBL
Assay Description
Binding affinity to human ERalpha
Bioorg Med Chem Lett 16: 3896-901 (2006)
Article DOI: 10.1016/j.bmcl.2006.05.036
BindingDB Entry DOI: 10.7270/Q24T6J01