null
SMILES: NC(=O)Cn1nc(oc1=O)-c1ccc(s1)-c1ccc(Br)cc1
InChI Key: InChIKey=NVJHNIKGVKWAGW-UHFFFAOYSA-N
Activity Spreadsheet -- Enzyme Inhibition Constant Data from BindingDB
Found 2 hits for monomerid = 50188243
Trg + Lig
Ki
nM
ΔG°
kcal/mole
IC50
nM
Kd
nM
EC50/IC50
nM
koff
s-1
kon
M-1s-1
pHTemp
°C
Platelet-activating factor acetylhydrolase IB subunit alpha2
(Homo sapiens (Human))
BDBM50188243
(CHEMBL3828611)
Show SMILES NC(=O)Cn1nc(oc1=O)-c1ccc(s1)-c1ccc(Br)cc1
Show InChI InChI=1S/C14H10BrN3O3S/c15-9-3-1-8(2-4-9)10-5-6-11(22-10)13-17-18(7-12(16)19)14(20)21-13/h1-6H,7H2,(H2,16,19)
n/an/a 6.00E+4n/an/an/an/an/an/a
Shiv Nadar University
Curated by ChEMBL
Assay Description
Inhibition of PAFAH1B2 (unknown origin) using 2-thiol-PAF as substrate by Ellman's assay
Bioorg Med Chem 24: 3953-3963 (2016)
BindingDB Entry DOI: 10.7270/Q2668G45
Platelet-activating factor acetylhydrolase IB subunit alpha2
(Homo sapiens (Human))
BDBM50188243
(CHEMBL3828611)
Show SMILES NC(=O)Cn1nc(oc1=O)-c1ccc(s1)-c1ccc(Br)cc1
Show InChI InChI=1S/C14H10BrN3O3S/c15-9-3-1-8(2-4-9)10-5-6-11(22-10)13-17-18(7-12(16)19)14(20)21-13/h1-6H,7H2,(H2,16,19)
n/an/a 5.00E+3n/an/an/an/an/an/a
Shiv Nadar University
Curated by ChEMBL
Assay Description
Time-dependent inhibition of PAFAH1B2 (unknown origin) using 2-thiol-PAF as substrate by Ellman's assay
Bioorg Med Chem 24: 3953-3963 (2016)
BindingDB Entry DOI: 10.7270/Q2668G45