BDBM50188300 2-(2,5-dimethyl-3-(7-(trifluoromethyl)quinolin-4-yl)-1H-indol-1-yl)acetic acid::CHEMBL214304
SMILES: Cc1c(-c2ccnc3cc(ccc23)C(F)(F)F)c2cc(C)ccc2n1CC(O)=O
InChI Key: InChIKey=UYLVLPRFGZUQIF-UHFFFAOYSA-N
Data: 1 IC50
Activity Spreadsheet -- Enzyme Inhibition Constant Data from BindingDB
Found 1 hit for monomerid = 50188300
Trg + Lig
Ki
nM
ΔG°
kcal/mole
IC50
nM
Kd
nM
EC50/IC50
nM
koff
s-1
kon
M-1s-1
pHTemp
°C
G protein-coupled receptor 44
(Homo sapiens (Human))
BDBM50188300
(2-(2,5-dimethyl-3-(7-(trifluoromethyl)quinolin-4-y...)
Show SMILES Cc1c(-c2ccnc3cc(ccc23)C(F)(F)F)c2cc(C)ccc2n1CC(O)=O |(11.76,-35.94,;10.22,-35.95,;9.31,-37.22,;9.8,-38.68,;11.3,-38.98,;11.79,-40.43,;10.76,-41.59,;9.25,-41.28,;8.24,-42.42,;6.75,-42.12,;6.26,-40.66,;7.28,-39.52,;8.77,-39.82,;5.73,-43.27,;4.63,-44.36,;6.85,-44.33,;4.61,-42.21,;7.83,-36.74,;6.49,-37.51,;5.16,-36.74,;3.83,-37.51,;5.16,-35.19,;6.49,-34.42,;7.83,-35.19,;9.3,-34.7,;9.77,-33.24,;11.28,-32.91,;12.32,-34.05,;11.76,-31.44,)|
Show InChI InChI=1S/C22H17F3N2O2/c1-12-3-6-19-17(9-12)21(13(2)27(19)11-20(28)29)16-7-8-26-18-10-14(22(23,24)25)4-5-15(16)18/h3-10H,11H2,1-2H3,(H,28,29)
Reactome pathway
n/an/a 5.40n/an/an/an/an/an/a
AstraZeneca R&D Charnwood
Curated by ChEMBL
Assay Description
Displacement of [3H]PGD2 from human CRTh2 expressed in HEK293 cells
Bioorg Med Chem Lett 16: 4287-90 (2006)
Article DOI: 10.1016/j.bmcl.2006.05.062
BindingDB Entry DOI: 10.7270/Q2G44PX7