BDBM50188503 (S)-2-((S)-2-Amino-propionylamino)-3-phenyl-propionic acid::2-(2-Amino-propionylamino)-3-phenyl-propionic acid::2-(2-Amino-propionylamino)-3-phenyl-propionic acid anion::Ala-Phe::CHEMBL57338
SMILES: C[C@H](N)C(=O)N[C@@H](Cc1ccccc1)C(O)=O
InChI Key: InChIKey=OMNVYXHOSHNURL-WPRPVWTQSA-N
Data: 3 IC50  1 EC50
Activity Spreadsheet -- Enzyme Inhibition Constant Data from BindingDB
Found 4 hits for monomerid = 50188503
Trg + Lig
Ki
nM
ΔG°
kcal/mole
IC50
nM
Kd
nM
EC50/IC50
nM
koff
s-1
kon
M-1s-1
pHTemp
°C
Angiotensin-converting enzyme
(Homo sapiens (Human))
BDBM50188503
((S)-2-((S)-2-Amino-propionylamino)-3-phenyl-propio...)
Show SMILES C[C@H](N)C(=O)N[C@@H](Cc1ccccc1)C(O)=O
Show InChI InChI=1S/C12H16N2O3/c1-8(13)11(15)14-10(12(16)17)7-9-5-3-2-4-6-9/h2-6,8,10H,7,13H2,1H3,(H,14,15)(H,16,17)/t8-,10-/m0/s1
Reactome pathway
n/an/a 7.58E+4n/an/an/an/an/an/a
Tianjin University
Curated by ChEMBL
Assay Description
Inhibition of ACE (unknown origin)
Eur J Med Chem 84: 100-6 (2014)
Article DOI: 10.1016/j.ejmech.2014.07.015
BindingDB Entry DOI: 10.7270/Q29025F2
Angiotensin-converting enzyme
(Homo sapiens (Human))
BDBM50188503
((S)-2-((S)-2-Amino-propionylamino)-3-phenyl-propio...)
Show SMILES C[C@H](N)C(=O)N[C@@H](Cc1ccccc1)C(O)=O
Show InChI InChI=1S/C12H16N2O3/c1-8(13)11(15)14-10(12(16)17)7-9-5-3-2-4-6-9/h2-6,8,10H,7,13H2,1H3,(H,14,15)(H,16,17)/t8-,10-/m0/s1
Reactome pathway
n/an/a 1.91E+5n/an/an/an/an/an/a
University of Illinois at Chicago
Curated by ChEMBL
Assay Description
Biological activity was measured against Angiotensin I converting enzyme
J Med Chem 38: 2705-13 (1995)
BindingDB Entry DOI: 10.7270/Q2GX4CSN
Oligopeptide transporter small intestine isoform
(Homo sapiens (Human))
BDBM50188503
((S)-2-((S)-2-Amino-propionylamino)-3-phenyl-propio...)
Show SMILES C[C@H](N)C(=O)N[C@@H](Cc1ccccc1)C(O)=O
Show InChI InChI=1S/C12H16N2O3/c1-8(13)11(15)14-10(12(16)17)7-9-5-3-2-4-6-9/h2-6,8,10H,7,13H2,1H3,(H,14,15)(H,16,17)/t8-,10-/m0/s1
Reactome pathway
n/an/an/an/a 8.00E+4n/an/an/an/a
Pharmaceutical Research Institute
Curated by ChEMBL
Assay Description
Activation of human PEPT1 expressed in MDCK cells
J Med Chem 49: 3636-44 (2006)
Article DOI: 10.1021/jm0511029
BindingDB Entry DOI: 10.7270/Q2P55P9R
Oligopeptide transporter small intestine isoform
(Homo sapiens (Human))
BDBM50188503
((S)-2-((S)-2-Amino-propionylamino)-3-phenyl-propio...)
Show SMILES C[C@H](N)C(=O)N[C@@H](Cc1ccccc1)C(O)=O
Show InChI InChI=1S/C12H16N2O3/c1-8(13)11(15)14-10(12(16)17)7-9-5-3-2-4-6-9/h2-6,8,10H,7,13H2,1H3,(H,14,15)(H,16,17)/t8-,10-/m0/s1
Reactome pathway
n/an/a 7.00E+4n/an/an/an/an/an/a
Pharmaceutical Research Institute
Curated by ChEMBL
Assay Description
Binding affinity to human PEPT1 assessed as inhibition of [14C]Gly-Sar uptake in MDCK cells
J Med Chem 49: 3636-44 (2006)
Article DOI: 10.1021/jm0511029
BindingDB Entry DOI: 10.7270/Q2P55P9R