BDBM50188785 CHEMBL209955::ammonium N-{4-[3-(4-methoxyphenyl)-2,2-bis(3-methyl-1,2,4-oxadiazol-5-yl)propyl]phenyl}sulfamate
SMILES: COc1ccc(CC(Cc2ccc(NS([O-])(=O)=O)cc2)(c2nc(C)no2)c2nc(C)no2)cc1
InChI Key: InChIKey=JMYIVXVREZIAFQ-UHFFFAOYSA-M
Data: 1 IC50
Activity Spreadsheet -- Enzyme Inhibition Constant Data from BindingDB
Found 1 hit for monomerid = 50188785
Trg + Lig
Ki
nM
ΔG°
kcal/mole
IC50
nM
Kd
nM
EC50/IC50
nM
koff
s-1
kon
M-1s-1
pHTemp
°C
Receptor-type tyrosine-protein phosphatase beta (PTPβ)
(Homo sapiens (Human))
BDBM50188785
(CHEMBL209955 | ammonium N-{4-[3-(4-methoxyphenyl)-...)
Show SMILES COc1ccc(CC(Cc2ccc(NS([O-])(=O)=O)cc2)(c2nc(C)no2)c2nc(C)no2)cc1
Show InChI InChI=1S/C22H23N5O6S/c1-14-23-20(32-25-14)22(21-24-15(2)26-33-21,13-17-6-10-19(31-3)11-7-17)12-16-4-8-18(9-5-16)27-34(28,29)30/h4-11,27H,12-13H2,1-3H3,(H,28,29,30)/p-1
n/an/a 340n/an/an/an/an/an/a
Procter & Gamble Pharmaceuticals
Curated by ChEMBL
Assay Description
Inhibition of HPTPbeta
Bioorg Med Chem Lett 16: 4252-6 (2006)
Article DOI: 10.1016/j.bmcl.2006.05.074
BindingDB Entry DOI: 10.7270/Q2D50MK4