BDBM50188787 CHEMBL213594::ammonium N-{4-[3-methoxy-2-(methoxycarbonyl)-3-oxo-2-(pyridin-4-ylmethyl)propyl]phenyl}sulfamate
SMILES: COC(=O)C(Cc1ccncc1)(Cc1ccc(NS([O-])(=O)=O)cc1)C(=O)OC
InChI Key: InChIKey=AWNSCXPWDCOPCA-UHFFFAOYSA-M
Data: 1 IC50
Activity Spreadsheet -- Enzyme Inhibition Constant Data from BindingDB
Found 1 hit for monomerid = 50188787
Trg + Lig
Ki
nM
ΔG°
kcal/mole
IC50
nM
Kd
nM
EC50/IC50
nM
koff
s-1
kon
M-1s-1
pHTemp
°C
Receptor-type tyrosine-protein phosphatase beta (PTPβ)
(Homo sapiens (Human))
BDBM50188787
(CHEMBL213594 | ammonium N-{4-[3-methoxy-2-(methoxy...)
Show SMILES COC(=O)C(Cc1ccncc1)(Cc1ccc(NS([O-])(=O)=O)cc1)C(=O)OC
Show InChI InChI=1S/C18H20N2O7S/c1-26-16(21)18(17(22)27-2,12-14-7-9-19-10-8-14)11-13-3-5-15(6-4-13)20-28(23,24)25/h3-10,20H,11-12H2,1-2H3,(H,23,24,25)/p-1
n/an/a 570n/an/an/an/an/an/a
Procter & Gamble Pharmaceuticals
Curated by ChEMBL
Assay Description
Inhibition of HPTPbeta
Bioorg Med Chem Lett 16: 4252-6 (2006)
Article DOI: 10.1016/j.bmcl.2006.05.074
BindingDB Entry DOI: 10.7270/Q2D50MK4