BDBM50188834 7-(4-chlorophenyl)-3-(6-(3-(dimethylamino)pyrrolidin-1-yl)pyridin-3-yl)-4H-chromen-4-one::CHEMBL210069
SMILES: CN(C)C1CCN(C1)c1ccc(cn1)-c1coc2cc(ccc2c1=O)-c1ccc(Cl)cc1
InChI Key: InChIKey=WUOVBRPWEZTIPN-UHFFFAOYSA-N
Data: 1 KI  1 IC50
Activity Spreadsheet -- Enzyme Inhibition Constant Data from BindingDB
Found 2 hits for monomerid = 50188834
Trg + Lig
Ki
nM
ΔG°
kcal/mole
IC50
nM
Kd
nM
EC50/IC50
nM
koff
s-1
kon
M-1s-1
pHTemp
°C
Melanin-concentrating hormone receptor
(Homo sapiens (Human))
BDBM50188834
(7-(4-chlorophenyl)-3-(6-(3-(dimethylamino)pyrrolid...)
Show SMILES CN(C)C1CCN(C1)c1ccc(cn1)-c1coc2cc(ccc2c1=O)-c1ccc(Cl)cc1
Show InChI InChI=1S/C26H24ClN3O2/c1-29(2)21-11-12-30(15-21)25-10-6-19(14-28-25)23-16-32-24-13-18(5-9-22(24)26(23)31)17-3-7-20(27)8-4-17/h3-10,13-14,16,21H,11-12,15H2,1-2H3
Reactome pathway
2.10n/an/an/an/an/an/an/an/a
Neurocrine Biosciences Inc.
Curated by ChEMBL
Assay Description
Binding affinity to human MCH1R
Bioorg Med Chem Lett 16: 4237-42 (2006)
Article DOI: 10.1016/j.bmcl.2006.05.075
BindingDB Entry DOI: 10.7270/Q2N29XRN
Melanin-concentrating hormone receptor
(Homo sapiens (Human))
BDBM50188834
(7-(4-chlorophenyl)-3-(6-(3-(dimethylamino)pyrrolid...)
Show SMILES CN(C)C1CCN(C1)c1ccc(cn1)-c1coc2cc(ccc2c1=O)-c1ccc(Cl)cc1
Show InChI InChI=1S/C26H24ClN3O2/c1-29(2)21-11-12-30(15-21)25-10-6-19(14-28-25)23-16-32-24-13-18(5-9-22(24)26(23)31)17-3-7-20(27)8-4-17/h3-10,13-14,16,21H,11-12,15H2,1-2H3
Reactome pathway
n/an/a 10n/an/an/an/an/an/a
Neurocrine Biosciences Inc.
Curated by ChEMBL
Assay Description
Activity at human MCH1R by GTPgammaS assay
Bioorg Med Chem Lett 16: 4237-42 (2006)
Article DOI: 10.1016/j.bmcl.2006.05.075
BindingDB Entry DOI: 10.7270/Q2N29XRN