BDBM50188910 CHEMBL3828337
SMILES: COc1ccc(cn1)-c1nc(N2CCOCC2)c2nc(CN(C)c3ncc(cn3)C(=O)NO)n(C(C)C)c2n1
InChI Key: InChIKey=GPTFICRJKMSGCC-UHFFFAOYSA-N
Data: 2 IC50
Activity Spreadsheet -- Enzyme Inhibition Constant Data from BindingDB
Found 2 hits for monomerid = 50188910
Trg + Lig
Ki
nM
ΔG°
kcal/mole
IC50
nM
Kd
nM
EC50/IC50
nM
koff
s-1
kon
M-1s-1
pHTemp
°C
Histone deacetylase 1
(Homo sapiens (Human))
BDBM50188910
(CHEMBL3828337)
Show SMILES COc1ccc(cn1)-c1nc(N2CCOCC2)c2nc(CN(C)c3ncc(cn3)C(=O)NO)n(C(C)C)c2n1
Show InChI InChI=1S/C25H30N10O4/c1-15(2)35-18(14-33(3)25-27-12-17(13-28-25)24(36)32-37)29-20-22(34-7-9-39-10-8-34)30-21(31-23(20)35)16-5-6-19(38-4)26-11-16/h5-6,11-13,15,37H,7-10,14H2,1-4H3,(H,32,36)
NCI pathway
Reactome pathway
n/an/a 62n/an/an/an/an/an/a
West China Hospital of Sichuan University
Curated by ChEMBL
Assay Description
Inhibition of full length C-terminal His/FLAG-tagged human recombinant HDAC1 expressed in baculovirus infected insect Sf9 cells using Ac-peptide-AMC ...
J Med Chem 59: 5488-504 (2016)
BindingDB Entry DOI: 10.7270/Q2T155K0
p110α/p85α
(Homo sapiens (Human))
BDBM50188910
(CHEMBL3828337)
Show SMILES COc1ccc(cn1)-c1nc(N2CCOCC2)c2nc(CN(C)c3ncc(cn3)C(=O)NO)n(C(C)C)c2n1
Show InChI InChI=1S/C25H30N10O4/c1-15(2)35-18(14-33(3)25-27-12-17(13-28-25)24(36)32-37)29-20-22(34-7-9-39-10-8-34)30-21(31-23(20)35)16-5-6-19(38-4)26-11-16/h5-6,11-13,15,37H,7-10,14H2,1-4H3,(H,32,36)
n/an/a>1.00E+3n/an/an/an/an/an/a
West China Hospital of Sichuan University
Curated by ChEMBL
Assay Description
Inhibition of full length recombinant human His-tagged p110 alpha/p85 alpha expressed in baculovirus expression system incubated for 1 hr by kinase-g...
J Med Chem 59: 5488-504 (2016)
BindingDB Entry DOI: 10.7270/Q2T155K0