BDBM50188923 CHEMBL211574::N-(2,4-dichlorophenethyl)-5-(2-(ethylamino)pyrimidin-4-yl)thiophene-2-carboxamide
SMILES: CCNc1nccc(n1)-c1ccc(s1)C(=O)NCCc1ccc(Cl)cc1Cl
InChI Key: InChIKey=VFIZNSNMLQIIMY-UHFFFAOYSA-N
Data: 1 IC50
Activity Spreadsheet -- Enzyme Inhibition Constant Data from BindingDB
Found 1 hit for monomerid = 50188923
Trg + Lig
Ki
nM
ΔG°
kcal/mole
IC50
nM
Kd
nM
EC50/IC50
nM
koff
s-1
kon
M-1s-1
pHTemp
°C
Serine/threonine-protein kinase AKT
(Homo sapiens (Human))
BDBM50188923
(CHEMBL211574 | N-(2,4-dichlorophenethyl)-5-(2-(eth...)
Show SMILES CCNc1nccc(n1)-c1ccc(s1)C(=O)NCCc1ccc(Cl)cc1Cl
Show InChI InChI=1S/C19H18Cl2N4OS/c1-2-22-19-24-10-8-15(25-19)16-5-6-17(27-16)18(26)23-9-7-12-3-4-13(20)11-14(12)21/h3-6,8,10-11H,2,7,9H2,1H3,(H,23,26)(H,22,24,25)
NCI pathway
Reactome pathway
n/an/a 1.50E+3n/an/an/an/an/an/a
Chiron Corporation
Curated by ChEMBL
Assay Description
Inhibition of AKT3 in presence of 0.2 uM ATP
Bioorg Med Chem Lett 16: 4163-8 (2006)
Article DOI: 10.1016/j.bmcl.2006.05.092
BindingDB Entry DOI: 10.7270/Q24M945C