BDBM50188928 CHEMBL376004::N-(4-chlorophenethyl)-5-(2-(methylamino)pyrimidin-4-yl)thiophene-2-carboxamide
SMILES: CNc1nccc(n1)-c1ccc(s1)C(=O)NCCc1ccc(Cl)cc1
InChI Key: InChIKey=YPNATZHZOCDUHJ-UHFFFAOYSA-N
Data: 1 IC50
Activity Spreadsheet -- Enzyme Inhibition Constant Data from BindingDB
Found 1 hit for monomerid = 50188928
Trg + Lig
Ki
nM
ΔG°
kcal/mole
IC50
nM
Kd
nM
EC50/IC50
nM
koff
s-1
kon
M-1s-1
pHTemp
°C
Serine/threonine-protein kinase AKT
(Homo sapiens (Human))
BDBM50188928
(CHEMBL376004 | N-(4-chlorophenethyl)-5-(2-(methyla...)
Show SMILES CNc1nccc(n1)-c1ccc(s1)C(=O)NCCc1ccc(Cl)cc1
Show InChI InChI=1S/C18H17ClN4OS/c1-20-18-22-11-9-14(23-18)15-6-7-16(25-15)17(24)21-10-8-12-2-4-13(19)5-3-12/h2-7,9,11H,8,10H2,1H3,(H,21,24)(H,20,22,23)
NCI pathway
Reactome pathway
n/an/a 1.10E+3n/an/an/an/an/an/a
Chiron Corporation
Curated by ChEMBL
Assay Description
Inhibition of AKT3 in presence of 0.2 uM ATP
Bioorg Med Chem Lett 16: 4163-8 (2006)
Article DOI: 10.1016/j.bmcl.2006.05.092
BindingDB Entry DOI: 10.7270/Q24M945C