BDBM50188941 CHEMBL380165::N-((R)-1-amino-3-(2,4-dichlorophenyl)propan-2-yl)-5-(2-(methylamino)pyrimidin-4-yl)thiophene-2-carboxamide
SMILES: CNc1nccc(n1)-c1ccc(s1)C(=O)N[C@@H](CN)Cc1ccc(Cl)cc1Cl
InChI Key: InChIKey=HHOVRZGUSBMKKU-CYBMUJFWSA-N
Data: 1 IC50
Activity Spreadsheet -- Enzyme Inhibition Constant Data from BindingDB
Found 1 hit for monomerid = 50188941
Trg + Lig
Ki
nM
ΔG°
kcal/mole
IC50
nM
Kd
nM
EC50/IC50
nM
koff
s-1
kon
M-1s-1
pHTemp
°C
Serine/threonine-protein kinase AKT
(Homo sapiens (Human))
BDBM50188941
(CHEMBL380165 | N-((R)-1-amino-3-(2,4-dichloropheny...)
Show SMILES CNc1nccc(n1)-c1ccc(s1)C(=O)N[C@@H](CN)Cc1ccc(Cl)cc1Cl
Show InChI InChI=1S/C19H19Cl2N5OS/c1-23-19-24-7-6-15(26-19)16-4-5-17(28-16)18(27)25-13(10-22)8-11-2-3-12(20)9-14(11)21/h2-7,9,13H,8,10,22H2,1H3,(H,25,27)(H,23,24,26)/t13-/m1/s1
NCI pathway
Reactome pathway
n/an/a 240n/an/an/an/an/an/a
Chiron Corporation
Curated by ChEMBL
Assay Description
Inhibition of AKT3 in presence of 0.2 uM ATP
Bioorg Med Chem Lett 16: 4163-8 (2006)
Article DOI: 10.1016/j.bmcl.2006.05.092
BindingDB Entry DOI: 10.7270/Q24M945C