BDBM50188946 CHEMBL379263::N-((R)-1-(2,4-dichlorophenyl)propan-2-yl)-5-(2-(methylamino)pyrimidin-4-yl)thiophene-2-carboxamide
SMILES: CNc1nccc(n1)-c1ccc(s1)C(=O)N[C@H](C)Cc1ccc(Cl)cc1Cl
InChI Key: InChIKey=VAUZNVKLRSEUFA-LLVKDONJSA-N
Data: 1 IC50
Activity Spreadsheet -- Enzyme Inhibition Constant Data from BindingDB
Found 1 hit for monomerid = 50188946
Trg + Lig
Ki
nM
ΔG°
kcal/mole
IC50
nM
Kd
nM
EC50/IC50
nM
koff
s-1
kon
M-1s-1
pHTemp
°C
Serine/threonine-protein kinase AKT
(Homo sapiens (Human))
BDBM50188946
(CHEMBL379263 | N-((R)-1-(2,4-dichlorophenyl)propan...)
Show SMILES CNc1nccc(n1)-c1ccc(s1)C(=O)N[C@H](C)Cc1ccc(Cl)cc1Cl
Show InChI InChI=1S/C19H18Cl2N4OS/c1-11(9-12-3-4-13(20)10-14(12)21)24-18(26)17-6-5-16(27-17)15-7-8-23-19(22-2)25-15/h3-8,10-11H,9H2,1-2H3,(H,24,26)(H,22,23,25)/t11-/m1/s1
NCI pathway
Reactome pathway
n/an/a 820n/an/an/an/an/an/a
Chiron Corporation
Curated by ChEMBL
Assay Description
Inhibition of AKT3 in presence of 0.2 uM ATP
Bioorg Med Chem Lett 16: 4163-8 (2006)
Article DOI: 10.1016/j.bmcl.2006.05.092
BindingDB Entry DOI: 10.7270/Q24M945C