BDBM50189022 (S)-2-[(S)-4-[(R)-2-[(S)-2-acetylamino-3-(3H-imidazol-4-yl)-propionylamino]-3-(4-fluoro-phenyl)-propionyl]-3-(3-guanidino-propyl)-2-oxo-piperazin-1-yl]-N-methyl-3-naphthalen-2-yl-propionamide::CHEMBL384774
SMILES: CNC(=O)[C@H](Cc1ccc2ccccc2c1)N1CCN([C@@H](CCCN=C(N)N)C1=O)C(=O)[C@@H](Cc1ccc(F)cc1)NC(=O)[C@H](Cc1cnc[nH]1)NC(C)=O
InChI Key: InChIKey=KOWZSZLHPBJHEB-HWFRFQLBSA-N
Data: 3 KI  3 EC50
Activity Spreadsheet -- Enzyme Inhibition Constant Data from BindingDB
Found 6 hits for monomerid = 50189022
Trg + Lig
Ki
nM
ΔG°
kcal/mole
IC50
nM
Kd
nM
EC50/IC50
nM
koff
s-1
kon
M-1s-1
pHTemp
°C
Melanocyte-stimulating hormone receptor
(Homo sapiens (Human))
BDBM50189022
((S)-2-[(S)-4-[(R)-2-[(S)-2-acetylamino-3-(3H-imida...)
Show SMILES CNC(=O)[C@H](Cc1ccc2ccccc2c1)N1CCN([C@@H](CCCN=C(N)N)C1=O)C(=O)[C@@H](Cc1ccc(F)cc1)NC(=O)[C@H](Cc1cnc[nH]1)NC(C)=O |wU:20.22,4.17,32.44,44.55,(15.61,-28.99,;16.95,-28.22,;18.29,-29,;18.28,-30.54,;19.62,-28.23,;20.95,-29.01,;20.95,-30.55,;19.61,-31.31,;19.61,-32.85,;20.94,-33.61,;20.94,-35.15,;22.28,-35.93,;23.61,-35.14,;23.6,-33.61,;22.28,-32.85,;22.28,-31.31,;19.63,-26.68,;18.29,-25.92,;18.3,-24.38,;19.63,-23.6,;20.97,-24.38,;22.3,-23.6,;23.63,-24.37,;24.96,-23.6,;26.29,-24.37,;27.63,-23.59,;28.97,-24.36,;27.63,-22.05,;20.96,-25.92,;22.29,-26.69,;19.63,-22.06,;20.96,-21.31,;18.29,-21.31,;16.95,-22.07,;15.62,-21.31,;14.28,-22.07,;12.95,-21.31,;12.95,-19.77,;11.61,-19.01,;14.28,-18.99,;15.61,-19.76,;18.29,-19.77,;19.63,-18.99,;20.97,-19.77,;19.63,-17.45,;20.97,-16.68,;22.31,-17.45,;22.47,-18.98,;23.98,-19.31,;24.76,-17.97,;23.72,-16.82,;18.29,-16.68,;18.29,-15.14,;16.95,-14.37,;19.62,-14.36,)|
Show InChI InChI=1S/C39H47FN10O5/c1-24(51)47-31(21-30-22-44-23-46-30)35(52)48-32(19-25-10-13-29(40)14-11-25)37(54)49-16-17-50(38(55)33(49)8-5-15-45-39(41)42)34(36(53)43-2)20-26-9-12-27-6-3-4-7-28(27)18-26/h3-4,6-7,9-14,18,22-23,31-34H,5,8,15-17,19-21H2,1-2H3,(H,43,53)(H,44,46)(H,47,51)(H,48,52)(H4,41,42,45)/t31-,32+,33-,34-/m0/s1
2n/an/an/an/an/an/an/an/a
Procter & Gamble Pharmaceuticals
Curated by ChEMBL
Assay Description
Binding affinity to human MC1R
Bioorg Med Chem Lett 16: 4668-73 (2006)
Article DOI: 10.1016/j.bmcl.2006.05.087
BindingDB Entry DOI: 10.7270/Q2W66KDF
Melanocortin receptor 4
(Homo sapiens (Human))
BDBM50189022
((S)-2-[(S)-4-[(R)-2-[(S)-2-acetylamino-3-(3H-imida...)
Show SMILES CNC(=O)[C@H](Cc1ccc2ccccc2c1)N1CCN([C@@H](CCCN=C(N)N)C1=O)C(=O)[C@@H](Cc1ccc(F)cc1)NC(=O)[C@H](Cc1cnc[nH]1)NC(C)=O |wU:20.22,4.17,32.44,44.55,(15.61,-28.99,;16.95,-28.22,;18.29,-29,;18.28,-30.54,;19.62,-28.23,;20.95,-29.01,;20.95,-30.55,;19.61,-31.31,;19.61,-32.85,;20.94,-33.61,;20.94,-35.15,;22.28,-35.93,;23.61,-35.14,;23.6,-33.61,;22.28,-32.85,;22.28,-31.31,;19.63,-26.68,;18.29,-25.92,;18.3,-24.38,;19.63,-23.6,;20.97,-24.38,;22.3,-23.6,;23.63,-24.37,;24.96,-23.6,;26.29,-24.37,;27.63,-23.59,;28.97,-24.36,;27.63,-22.05,;20.96,-25.92,;22.29,-26.69,;19.63,-22.06,;20.96,-21.31,;18.29,-21.31,;16.95,-22.07,;15.62,-21.31,;14.28,-22.07,;12.95,-21.31,;12.95,-19.77,;11.61,-19.01,;14.28,-18.99,;15.61,-19.76,;18.29,-19.77,;19.63,-18.99,;20.97,-19.77,;19.63,-17.45,;20.97,-16.68,;22.31,-17.45,;22.47,-18.98,;23.98,-19.31,;24.76,-17.97,;23.72,-16.82,;18.29,-16.68,;18.29,-15.14,;16.95,-14.37,;19.62,-14.36,)|
Show InChI InChI=1S/C39H47FN10O5/c1-24(51)47-31(21-30-22-44-23-46-30)35(52)48-32(19-25-10-13-29(40)14-11-25)37(54)49-16-17-50(38(55)33(49)8-5-15-45-39(41)42)34(36(53)43-2)20-26-9-12-27-6-3-4-7-28(27)18-26/h3-4,6-7,9-14,18,22-23,31-34H,5,8,15-17,19-21H2,1-2H3,(H,43,53)(H,44,46)(H,47,51)(H,48,52)(H4,41,42,45)/t31-,32+,33-,34-/m0/s1
5n/an/an/an/an/an/an/an/a
Procter & Gamble Pharmaceuticals
Curated by ChEMBL
Assay Description
Binding affinity to human MC4R
Bioorg Med Chem Lett 16: 4668-73 (2006)
Article DOI: 10.1016/j.bmcl.2006.05.087
BindingDB Entry DOI: 10.7270/Q2W66KDF
Melanocortin receptor 3
(Homo sapiens (Human))
BDBM50189022
((S)-2-[(S)-4-[(R)-2-[(S)-2-acetylamino-3-(3H-imida...)
Show SMILES CNC(=O)[C@H](Cc1ccc2ccccc2c1)N1CCN([C@@H](CCCN=C(N)N)C1=O)C(=O)[C@@H](Cc1ccc(F)cc1)NC(=O)[C@H](Cc1cnc[nH]1)NC(C)=O |wU:20.22,4.17,32.44,44.55,(15.61,-28.99,;16.95,-28.22,;18.29,-29,;18.28,-30.54,;19.62,-28.23,;20.95,-29.01,;20.95,-30.55,;19.61,-31.31,;19.61,-32.85,;20.94,-33.61,;20.94,-35.15,;22.28,-35.93,;23.61,-35.14,;23.6,-33.61,;22.28,-32.85,;22.28,-31.31,;19.63,-26.68,;18.29,-25.92,;18.3,-24.38,;19.63,-23.6,;20.97,-24.38,;22.3,-23.6,;23.63,-24.37,;24.96,-23.6,;26.29,-24.37,;27.63,-23.59,;28.97,-24.36,;27.63,-22.05,;20.96,-25.92,;22.29,-26.69,;19.63,-22.06,;20.96,-21.31,;18.29,-21.31,;16.95,-22.07,;15.62,-21.31,;14.28,-22.07,;12.95,-21.31,;12.95,-19.77,;11.61,-19.01,;14.28,-18.99,;15.61,-19.76,;18.29,-19.77,;19.63,-18.99,;20.97,-19.77,;19.63,-17.45,;20.97,-16.68,;22.31,-17.45,;22.47,-18.98,;23.98,-19.31,;24.76,-17.97,;23.72,-16.82,;18.29,-16.68,;18.29,-15.14,;16.95,-14.37,;19.62,-14.36,)|
Show InChI InChI=1S/C39H47FN10O5/c1-24(51)47-31(21-30-22-44-23-46-30)35(52)48-32(19-25-10-13-29(40)14-11-25)37(54)49-16-17-50(38(55)33(49)8-5-15-45-39(41)42)34(36(53)43-2)20-26-9-12-27-6-3-4-7-28(27)18-26/h3-4,6-7,9-14,18,22-23,31-34H,5,8,15-17,19-21H2,1-2H3,(H,43,53)(H,44,46)(H,47,51)(H,48,52)(H4,41,42,45)/t31-,32+,33-,34-/m0/s1
35n/an/an/an/an/an/an/an/a
Procter & Gamble Pharmaceuticals
Curated by ChEMBL
Assay Description
Binding affinity to human MC3R
Bioorg Med Chem Lett 16: 4668-73 (2006)
Article DOI: 10.1016/j.bmcl.2006.05.087
BindingDB Entry DOI: 10.7270/Q2W66KDF
Melanocyte-stimulating hormone receptor
(Homo sapiens (Human))
BDBM50189022
((S)-2-[(S)-4-[(R)-2-[(S)-2-acetylamino-3-(3H-imida...)
Show SMILES CNC(=O)[C@H](Cc1ccc2ccccc2c1)N1CCN([C@@H](CCCN=C(N)N)C1=O)C(=O)[C@@H](Cc1ccc(F)cc1)NC(=O)[C@H](Cc1cnc[nH]1)NC(C)=O |wU:20.22,4.17,32.44,44.55,(15.61,-28.99,;16.95,-28.22,;18.29,-29,;18.28,-30.54,;19.62,-28.23,;20.95,-29.01,;20.95,-30.55,;19.61,-31.31,;19.61,-32.85,;20.94,-33.61,;20.94,-35.15,;22.28,-35.93,;23.61,-35.14,;23.6,-33.61,;22.28,-32.85,;22.28,-31.31,;19.63,-26.68,;18.29,-25.92,;18.3,-24.38,;19.63,-23.6,;20.97,-24.38,;22.3,-23.6,;23.63,-24.37,;24.96,-23.6,;26.29,-24.37,;27.63,-23.59,;28.97,-24.36,;27.63,-22.05,;20.96,-25.92,;22.29,-26.69,;19.63,-22.06,;20.96,-21.31,;18.29,-21.31,;16.95,-22.07,;15.62,-21.31,;14.28,-22.07,;12.95,-21.31,;12.95,-19.77,;11.61,-19.01,;14.28,-18.99,;15.61,-19.76,;18.29,-19.77,;19.63,-18.99,;20.97,-19.77,;19.63,-17.45,;20.97,-16.68,;22.31,-17.45,;22.47,-18.98,;23.98,-19.31,;24.76,-17.97,;23.72,-16.82,;18.29,-16.68,;18.29,-15.14,;16.95,-14.37,;19.62,-14.36,)|
Show InChI InChI=1S/C39H47FN10O5/c1-24(51)47-31(21-30-22-44-23-46-30)35(52)48-32(19-25-10-13-29(40)14-11-25)37(54)49-16-17-50(38(55)33(49)8-5-15-45-39(41)42)34(36(53)43-2)20-26-9-12-27-6-3-4-7-28(27)18-26/h3-4,6-7,9-14,18,22-23,31-34H,5,8,15-17,19-21H2,1-2H3,(H,43,53)(H,44,46)(H,47,51)(H,48,52)(H4,41,42,45)/t31-,32+,33-,34-/m0/s1
n/an/an/an/a 1.70n/an/an/an/a
Procter & Gamble Pharmaceuticals
Curated by ChEMBL
Assay Description
Agonist activity at human MC1R
Bioorg Med Chem Lett 16: 4668-73 (2006)
Article DOI: 10.1016/j.bmcl.2006.05.087
BindingDB Entry DOI: 10.7270/Q2W66KDF
Melanocortin receptor 4
(Homo sapiens (Human))
BDBM50189022
((S)-2-[(S)-4-[(R)-2-[(S)-2-acetylamino-3-(3H-imida...)
Show SMILES CNC(=O)[C@H](Cc1ccc2ccccc2c1)N1CCN([C@@H](CCCN=C(N)N)C1=O)C(=O)[C@@H](Cc1ccc(F)cc1)NC(=O)[C@H](Cc1cnc[nH]1)NC(C)=O |wU:20.22,4.17,32.44,44.55,(15.61,-28.99,;16.95,-28.22,;18.29,-29,;18.28,-30.54,;19.62,-28.23,;20.95,-29.01,;20.95,-30.55,;19.61,-31.31,;19.61,-32.85,;20.94,-33.61,;20.94,-35.15,;22.28,-35.93,;23.61,-35.14,;23.6,-33.61,;22.28,-32.85,;22.28,-31.31,;19.63,-26.68,;18.29,-25.92,;18.3,-24.38,;19.63,-23.6,;20.97,-24.38,;22.3,-23.6,;23.63,-24.37,;24.96,-23.6,;26.29,-24.37,;27.63,-23.59,;28.97,-24.36,;27.63,-22.05,;20.96,-25.92,;22.29,-26.69,;19.63,-22.06,;20.96,-21.31,;18.29,-21.31,;16.95,-22.07,;15.62,-21.31,;14.28,-22.07,;12.95,-21.31,;12.95,-19.77,;11.61,-19.01,;14.28,-18.99,;15.61,-19.76,;18.29,-19.77,;19.63,-18.99,;20.97,-19.77,;19.63,-17.45,;20.97,-16.68,;22.31,-17.45,;22.47,-18.98,;23.98,-19.31,;24.76,-17.97,;23.72,-16.82,;18.29,-16.68,;18.29,-15.14,;16.95,-14.37,;19.62,-14.36,)|
Show InChI InChI=1S/C39H47FN10O5/c1-24(51)47-31(21-30-22-44-23-46-30)35(52)48-32(19-25-10-13-29(40)14-11-25)37(54)49-16-17-50(38(55)33(49)8-5-15-45-39(41)42)34(36(53)43-2)20-26-9-12-27-6-3-4-7-28(27)18-26/h3-4,6-7,9-14,18,22-23,31-34H,5,8,15-17,19-21H2,1-2H3,(H,43,53)(H,44,46)(H,47,51)(H,48,52)(H4,41,42,45)/t31-,32+,33-,34-/m0/s1
n/an/an/an/a 2n/an/an/an/a
Procter & Gamble Pharmaceuticals
Curated by ChEMBL
Assay Description
Agonist activity at human MC4R
Bioorg Med Chem Lett 16: 4668-73 (2006)
Article DOI: 10.1016/j.bmcl.2006.05.087
BindingDB Entry DOI: 10.7270/Q2W66KDF
Melanocortin receptor 3
(Homo sapiens (Human))
BDBM50189022
((S)-2-[(S)-4-[(R)-2-[(S)-2-acetylamino-3-(3H-imida...)
Show SMILES CNC(=O)[C@H](Cc1ccc2ccccc2c1)N1CCN([C@@H](CCCN=C(N)N)C1=O)C(=O)[C@@H](Cc1ccc(F)cc1)NC(=O)[C@H](Cc1cnc[nH]1)NC(C)=O |wU:20.22,4.17,32.44,44.55,(15.61,-28.99,;16.95,-28.22,;18.29,-29,;18.28,-30.54,;19.62,-28.23,;20.95,-29.01,;20.95,-30.55,;19.61,-31.31,;19.61,-32.85,;20.94,-33.61,;20.94,-35.15,;22.28,-35.93,;23.61,-35.14,;23.6,-33.61,;22.28,-32.85,;22.28,-31.31,;19.63,-26.68,;18.29,-25.92,;18.3,-24.38,;19.63,-23.6,;20.97,-24.38,;22.3,-23.6,;23.63,-24.37,;24.96,-23.6,;26.29,-24.37,;27.63,-23.59,;28.97,-24.36,;27.63,-22.05,;20.96,-25.92,;22.29,-26.69,;19.63,-22.06,;20.96,-21.31,;18.29,-21.31,;16.95,-22.07,;15.62,-21.31,;14.28,-22.07,;12.95,-21.31,;12.95,-19.77,;11.61,-19.01,;14.28,-18.99,;15.61,-19.76,;18.29,-19.77,;19.63,-18.99,;20.97,-19.77,;19.63,-17.45,;20.97,-16.68,;22.31,-17.45,;22.47,-18.98,;23.98,-19.31,;24.76,-17.97,;23.72,-16.82,;18.29,-16.68,;18.29,-15.14,;16.95,-14.37,;19.62,-14.36,)|
Show InChI InChI=1S/C39H47FN10O5/c1-24(51)47-31(21-30-22-44-23-46-30)35(52)48-32(19-25-10-13-29(40)14-11-25)37(54)49-16-17-50(38(55)33(49)8-5-15-45-39(41)42)34(36(53)43-2)20-26-9-12-27-6-3-4-7-28(27)18-26/h3-4,6-7,9-14,18,22-23,31-34H,5,8,15-17,19-21H2,1-2H3,(H,43,53)(H,44,46)(H,47,51)(H,48,52)(H4,41,42,45)/t31-,32+,33-,34-/m0/s1
n/an/an/an/a 6n/an/an/an/a
Procter & Gamble Pharmaceuticals
Curated by ChEMBL
Assay Description
Agonist activity at human MC3R
Bioorg Med Chem Lett 16: 4668-73 (2006)
Article DOI: 10.1016/j.bmcl.2006.05.087
BindingDB Entry DOI: 10.7270/Q2W66KDF