BDBM50189024 (S)-2-[(S)-4-[(R)-2-[(S)-2-acetylamino-3-(4-hydroxy-phenyl)-propionylamino]-3-(4-fluoro-phenyl)-propionyl]-3-(3-guanidino-propyl)-2-oxo-piperazin-1-yl]-N-methyl-3-naphthalen-2-yl-propionamide::CHEMBL385000
SMILES: [#6]-[#7]-[#6](=O)-[#6@H](-[#6]-c1ccc2ccccc2c1)-[#7]-1-[#6]-[#6]-[#7](-[#6@@H](-[#6]-[#6]-[#6]\[#7]=[#6](\[#7])-[#7])-[#6]-1=O)-[#6](=O)-[#6@@H](-[#6]-c1ccc(F)cc1)-[#7]-[#6](=O)-[#6@H](-[#6]-c1ccc(-[#8])cc1)-[#7]-[#6](-[#6])=O
InChI Key: InChIKey=CBZNNNCTDMTAGU-NBRFXYHLSA-N
Data: 3 KI  3 EC50
Activity Spreadsheet -- Enzyme Inhibition Constant Data from BindingDB
Found 6 hits for monomerid = 50189024
Trg + Lig
Ki
nM
ΔG°
kcal/mole
IC50
nM
Kd
nM
EC50/IC50
nM
koff
s-1
kon
M-1s-1
pHTemp
°C
Melanocortin receptor 4
(Homo sapiens (Human))
BDBM50189024
((S)-2-[(S)-4-[(R)-2-[(S)-2-acetylamino-3-(4-hydrox...)
Show SMILES [#6]-[#7]-[#6](=O)-[#6@H](-[#6]-c1ccc2ccccc2c1)-[#7]-1-[#6]-[#6]-[#7](-[#6@@H](-[#6]-[#6]-[#6]\[#7]=[#6](\[#7])-[#7])-[#6]-1=O)-[#6](=O)-[#6@@H](-[#6]-c1ccc(F)cc1)-[#7]-[#6](=O)-[#6@H](-[#6]-c1ccc(-[#8])cc1)-[#7]-[#6](-[#6])=O
Show InChI InChI=1S/C42H49FN8O6/c1-26(52)48-34(23-28-12-17-33(53)18-13-28)38(54)49-35(24-27-10-15-32(43)16-11-27)40(56)50-20-21-51(41(57)36(50)8-5-19-47-42(44)45)37(39(55)46-2)25-29-9-14-30-6-3-4-7-31(30)22-29/h3-4,6-7,9-18,22,34-37,53H,5,8,19-21,23-25H2,1-2H3,(H,46,55)(H,48,52)(H,49,54)(H4,44,45,47)/t34-,35+,36-,37-/m0/s1
0.400n/an/an/an/an/an/an/an/a
Procter & Gamble Pharmaceuticals
Curated by ChEMBL
Assay Description
Binding affinity to human MC4R
Bioorg Med Chem Lett 16: 4668-73 (2006)
Article DOI: 10.1016/j.bmcl.2006.05.087
BindingDB Entry DOI: 10.7270/Q2W66KDF
Melanocortin receptor 3
(Homo sapiens (Human))
BDBM50189024
((S)-2-[(S)-4-[(R)-2-[(S)-2-acetylamino-3-(4-hydrox...)
Show SMILES [#6]-[#7]-[#6](=O)-[#6@H](-[#6]-c1ccc2ccccc2c1)-[#7]-1-[#6]-[#6]-[#7](-[#6@@H](-[#6]-[#6]-[#6]\[#7]=[#6](\[#7])-[#7])-[#6]-1=O)-[#6](=O)-[#6@@H](-[#6]-c1ccc(F)cc1)-[#7]-[#6](=O)-[#6@H](-[#6]-c1ccc(-[#8])cc1)-[#7]-[#6](-[#6])=O
Show InChI InChI=1S/C42H49FN8O6/c1-26(52)48-34(23-28-12-17-33(53)18-13-28)38(54)49-35(24-27-10-15-32(43)16-11-27)40(56)50-20-21-51(41(57)36(50)8-5-19-47-42(44)45)37(39(55)46-2)25-29-9-14-30-6-3-4-7-31(30)22-29/h3-4,6-7,9-18,22,34-37,53H,5,8,19-21,23-25H2,1-2H3,(H,46,55)(H,48,52)(H,49,54)(H4,44,45,47)/t34-,35+,36-,37-/m0/s1
1.10n/an/an/an/an/an/an/an/a
Procter & Gamble Pharmaceuticals
Curated by ChEMBL
Assay Description
Binding affinity to human MC3R
Bioorg Med Chem Lett 16: 4668-73 (2006)
Article DOI: 10.1016/j.bmcl.2006.05.087
BindingDB Entry DOI: 10.7270/Q2W66KDF
Melanocyte-stimulating hormone receptor
(Homo sapiens (Human))
BDBM50189024
((S)-2-[(S)-4-[(R)-2-[(S)-2-acetylamino-3-(4-hydrox...)
Show SMILES [#6]-[#7]-[#6](=O)-[#6@H](-[#6]-c1ccc2ccccc2c1)-[#7]-1-[#6]-[#6]-[#7](-[#6@@H](-[#6]-[#6]-[#6]\[#7]=[#6](\[#7])-[#7])-[#6]-1=O)-[#6](=O)-[#6@@H](-[#6]-c1ccc(F)cc1)-[#7]-[#6](=O)-[#6@H](-[#6]-c1ccc(-[#8])cc1)-[#7]-[#6](-[#6])=O
Show InChI InChI=1S/C42H49FN8O6/c1-26(52)48-34(23-28-12-17-33(53)18-13-28)38(54)49-35(24-27-10-15-32(43)16-11-27)40(56)50-20-21-51(41(57)36(50)8-5-19-47-42(44)45)37(39(55)46-2)25-29-9-14-30-6-3-4-7-31(30)22-29/h3-4,6-7,9-18,22,34-37,53H,5,8,19-21,23-25H2,1-2H3,(H,46,55)(H,48,52)(H,49,54)(H4,44,45,47)/t34-,35+,36-,37-/m0/s1
14n/an/an/an/an/an/an/an/a
Procter & Gamble Pharmaceuticals
Curated by ChEMBL
Assay Description
Binding affinity to human MC1R
Bioorg Med Chem Lett 16: 4668-73 (2006)
Article DOI: 10.1016/j.bmcl.2006.05.087
BindingDB Entry DOI: 10.7270/Q2W66KDF
Melanocortin receptor 4
(Homo sapiens (Human))
BDBM50189024
((S)-2-[(S)-4-[(R)-2-[(S)-2-acetylamino-3-(4-hydrox...)
Show SMILES [#6]-[#7]-[#6](=O)-[#6@H](-[#6]-c1ccc2ccccc2c1)-[#7]-1-[#6]-[#6]-[#7](-[#6@@H](-[#6]-[#6]-[#6]\[#7]=[#6](\[#7])-[#7])-[#6]-1=O)-[#6](=O)-[#6@@H](-[#6]-c1ccc(F)cc1)-[#7]-[#6](=O)-[#6@H](-[#6]-c1ccc(-[#8])cc1)-[#7]-[#6](-[#6])=O
Show InChI InChI=1S/C42H49FN8O6/c1-26(52)48-34(23-28-12-17-33(53)18-13-28)38(54)49-35(24-27-10-15-32(43)16-11-27)40(56)50-20-21-51(41(57)36(50)8-5-19-47-42(44)45)37(39(55)46-2)25-29-9-14-30-6-3-4-7-31(30)22-29/h3-4,6-7,9-18,22,34-37,53H,5,8,19-21,23-25H2,1-2H3,(H,46,55)(H,48,52)(H,49,54)(H4,44,45,47)/t34-,35+,36-,37-/m0/s1
n/an/an/an/a 8.70n/an/an/an/a
Procter & Gamble Pharmaceuticals
Curated by ChEMBL
Assay Description
Agonist activity at human MC4R
Bioorg Med Chem Lett 16: 4668-73 (2006)
Article DOI: 10.1016/j.bmcl.2006.05.087
BindingDB Entry DOI: 10.7270/Q2W66KDF
Melanocortin receptor 3
(Homo sapiens (Human))
BDBM50189024
((S)-2-[(S)-4-[(R)-2-[(S)-2-acetylamino-3-(4-hydrox...)
Show SMILES [#6]-[#7]-[#6](=O)-[#6@H](-[#6]-c1ccc2ccccc2c1)-[#7]-1-[#6]-[#6]-[#7](-[#6@@H](-[#6]-[#6]-[#6]\[#7]=[#6](\[#7])-[#7])-[#6]-1=O)-[#6](=O)-[#6@@H](-[#6]-c1ccc(F)cc1)-[#7]-[#6](=O)-[#6@H](-[#6]-c1ccc(-[#8])cc1)-[#7]-[#6](-[#6])=O
Show InChI InChI=1S/C42H49FN8O6/c1-26(52)48-34(23-28-12-17-33(53)18-13-28)38(54)49-35(24-27-10-15-32(43)16-11-27)40(56)50-20-21-51(41(57)36(50)8-5-19-47-42(44)45)37(39(55)46-2)25-29-9-14-30-6-3-4-7-31(30)22-29/h3-4,6-7,9-18,22,34-37,53H,5,8,19-21,23-25H2,1-2H3,(H,46,55)(H,48,52)(H,49,54)(H4,44,45,47)/t34-,35+,36-,37-/m0/s1
n/an/an/an/a 2n/an/an/an/a
Procter & Gamble Pharmaceuticals
Curated by ChEMBL
Assay Description
Agonist activity at human MC3R
Bioorg Med Chem Lett 16: 4668-73 (2006)
Article DOI: 10.1016/j.bmcl.2006.05.087
BindingDB Entry DOI: 10.7270/Q2W66KDF
Melanocyte-stimulating hormone receptor
(Homo sapiens (Human))
BDBM50189024
((S)-2-[(S)-4-[(R)-2-[(S)-2-acetylamino-3-(4-hydrox...)
Show SMILES [#6]-[#7]-[#6](=O)-[#6@H](-[#6]-c1ccc2ccccc2c1)-[#7]-1-[#6]-[#6]-[#7](-[#6@@H](-[#6]-[#6]-[#6]\[#7]=[#6](\[#7])-[#7])-[#6]-1=O)-[#6](=O)-[#6@@H](-[#6]-c1ccc(F)cc1)-[#7]-[#6](=O)-[#6@H](-[#6]-c1ccc(-[#8])cc1)-[#7]-[#6](-[#6])=O
Show InChI InChI=1S/C42H49FN8O6/c1-26(52)48-34(23-28-12-17-33(53)18-13-28)38(54)49-35(24-27-10-15-32(43)16-11-27)40(56)50-20-21-51(41(57)36(50)8-5-19-47-42(44)45)37(39(55)46-2)25-29-9-14-30-6-3-4-7-31(30)22-29/h3-4,6-7,9-18,22,34-37,53H,5,8,19-21,23-25H2,1-2H3,(H,46,55)(H,48,52)(H,49,54)(H4,44,45,47)/t34-,35+,36-,37-/m0/s1
n/an/an/an/a 30n/an/an/an/a
Procter & Gamble Pharmaceuticals
Curated by ChEMBL
Assay Description
Agonist activity at human MC1R
Bioorg Med Chem Lett 16: 4668-73 (2006)
Article DOI: 10.1016/j.bmcl.2006.05.087
BindingDB Entry DOI: 10.7270/Q2W66KDF