BDBM50189082 (S)(-)-6-bromo-9a-butyl-8,9,9a,10-tetrahydro-3H-1,2,3-triaza-cyclopenta[a]fluoren-7-one::CHEMBL215802
SMILES: CCCC[C@]12Cc3c(ccc4nn[nH]c34)C1=C(Br)C(=O)CC2
InChI Key: InChIKey=GDXSIURHFVXLSM-KRWDZBQOSA-N
Data: 2 IC50  2 EC50
Activity Spreadsheet -- Enzyme Inhibition Constant Data from BindingDB
Found 4 hits for monomerid = 50189082
Trg + Lig
Ki
nM
ΔG°
kcal/mole
IC50
nM
Kd
nM
EC50/IC50
nM
koff
s-1
kon
M-1s-1
pHTemp
°C
Estradiol receptor beta (ERβ)
(Homo sapiens (Human))
BDBM50189082
((S)(-)-6-bromo-9a-butyl-8,9,9a,10-tetrahydro-3H-1,...)
Show SMILES CCCC[C@]12Cc3c(ccc4nn[nH]c34)C1=C(Br)C(=O)CC2 |t:18|
Show InChI InChI=1S/C17H18BrN3O/c1-2-3-7-17-8-6-13(22)15(18)14(17)10-4-5-12-16(11(10)9-17)20-21-19-12/h4-5H,2-3,6-9H2,1H3,(H,19,20,21)/t17-/m0/s1
n/an/an/an/a 5.5n/an/an/an/a
Merck Research Laboratories
Curated by ChEMBL
Assay Description
Agonist activity at human recombinant ERbeta expressed in HEK293 cells by alkaline phosphatase reporter gene transactivation assay
Bioorg Med Chem Lett 16: 4652-6 (2006)
Article DOI: 10.1016/j.bmcl.2006.05.103
BindingDB Entry DOI: 10.7270/Q2MP52WG
Estrogen receptor
(Homo sapiens (Human))
BDBM50189082
((S)(-)-6-bromo-9a-butyl-8,9,9a,10-tetrahydro-3H-1,...)
Show SMILES CCCC[C@]12Cc3c(ccc4nn[nH]c34)C1=C(Br)C(=O)CC2 |t:18|
Show InChI InChI=1S/C17H18BrN3O/c1-2-3-7-17-8-6-13(22)15(18)14(17)10-4-5-12-16(11(10)9-17)20-21-19-12/h4-5H,2-3,6-9H2,1H3,(H,19,20,21)/t17-/m0/s1
n/an/an/an/a 519n/an/an/an/a
Merck Research Laboratories
Curated by ChEMBL
Assay Description
Agonist activity at human recombinant ERalpha expressed in HEK293 cells by alkaline phosphatase reporter gene transactivation assay
Bioorg Med Chem Lett 16: 4652-6 (2006)
Article DOI: 10.1016/j.bmcl.2006.05.103
BindingDB Entry DOI: 10.7270/Q2MP52WG
Estradiol receptor beta (ERβ)
(Homo sapiens (Human))
BDBM50189082
((S)(-)-6-bromo-9a-butyl-8,9,9a,10-tetrahydro-3H-1,...)
Show SMILES CCCC[C@]12Cc3c(ccc4nn[nH]c34)C1=C(Br)C(=O)CC2 |t:18|
Show InChI InChI=1S/C17H18BrN3O/c1-2-3-7-17-8-6-13(22)15(18)14(17)10-4-5-12-16(11(10)9-17)20-21-19-12/h4-5H,2-3,6-9H2,1H3,(H,19,20,21)/t17-/m0/s1
n/an/a 5.70n/an/an/an/an/an/a
Merck Research Laboratories
Curated by ChEMBL
Assay Description
Binding affinity to human recombinant ERbeta by scintillation proximity assay
Bioorg Med Chem Lett 16: 4652-6 (2006)
Article DOI: 10.1016/j.bmcl.2006.05.103
BindingDB Entry DOI: 10.7270/Q2MP52WG
Estrogen receptor
(Homo sapiens (Human))
BDBM50189082
((S)(-)-6-bromo-9a-butyl-8,9,9a,10-tetrahydro-3H-1,...)
Show SMILES CCCC[C@]12Cc3c(ccc4nn[nH]c34)C1=C(Br)C(=O)CC2 |t:18|
Show InChI InChI=1S/C17H18BrN3O/c1-2-3-7-17-8-6-13(22)15(18)14(17)10-4-5-12-16(11(10)9-17)20-21-19-12/h4-5H,2-3,6-9H2,1H3,(H,19,20,21)/t17-/m0/s1
n/an/a 1.91E+3n/an/an/an/an/an/a
Merck Research Laboratories
Curated by ChEMBL
Assay Description
Binding affinity to human recombinant ERalpha by scintillation proximity assay
Bioorg Med Chem Lett 16: 4652-6 (2006)
Article DOI: 10.1016/j.bmcl.2006.05.103
BindingDB Entry DOI: 10.7270/Q2MP52WG