BDBM50189154 (2S,4aR,6aR,7R,9S,10aS,10bR)-methyl 2-(furan-3-yl)-6a,10b-dimethyl-9-(N-methylpropionamido)-4,10-dioxo-dodecahydro-1H-benzo[f]isochromene-7-carboxylate::CHEMBL212648
SMILES: CCC(=O)N(C)[C@H]1C[C@@H](C(=O)OC)[C@]2(C)CC[C@H]3C(=O)O[C@@H](C[C@]3(C)[C@H]2C1=O)c1ccoc1
InChI Key: InChIKey=SARWMCGFDDRURK-GEJGOZOKSA-N
Data: 1 KI  1 EC50
Activity Spreadsheet -- Enzyme Inhibition Constant Data from BindingDB
Found 2 hits for monomerid = 50189154
Trg + Lig
Ki
nM
ΔG°
kcal/mole
IC50
nM
Kd
nM
EC50/IC50
nM
koff
s-1
kon
M-1s-1
pHTemp
°C
Kappa-type opioid receptor
(Homo sapiens (Human))
BDBM50189154
((2S,4aR,6aR,7R,9S,10aS,10bR)-methyl 2-(furan-3-yl)...)
Show SMILES CCC(=O)N(C)[C@H]1C[C@@H](C(=O)OC)[C@]2(C)CC[C@H]3C(=O)O[C@@H](C[C@]3(C)[C@H]2C1=O)c1ccoc1
Show InChI InChI=1S/C25H33NO7/c1-6-19(27)26(4)17-11-16(22(29)31-5)24(2)9-7-15-23(30)33-18(14-8-10-32-13-14)12-25(15,3)21(24)20(17)28/h8,10,13,15-18,21H,6-7,9,11-12H2,1-5H3/t15-,16-,17-,18-,21-,24-,25-/m0/s1
Reactome pathway
1.60n/an/an/an/an/an/an/an/a
McLean Hospital
Curated by ChEMBL
Assay Description
Inhibition of [3H]diprenorphine binding to human KOR expressed in CHO cells
Bioorg Med Chem Lett 16: 4679-85 (2006)
Article DOI: 10.1016/j.bmcl.2006.05.093
BindingDB Entry DOI: 10.7270/Q2GX4B55
Kappa-type opioid receptor
(Homo sapiens (Human))
BDBM50189154
((2S,4aR,6aR,7R,9S,10aS,10bR)-methyl 2-(furan-3-yl)...)
Show SMILES CCC(=O)N(C)[C@H]1C[C@@H](C(=O)OC)[C@]2(C)CC[C@H]3C(=O)O[C@@H](C[C@]3(C)[C@H]2C1=O)c1ccoc1
Show InChI InChI=1S/C25H33NO7/c1-6-19(27)26(4)17-11-16(22(29)31-5)24(2)9-7-15-23(30)33-18(14-8-10-32-13-14)12-25(15,3)21(24)20(17)28/h8,10,13,15-18,21H,6-7,9,11-12H2,1-5H3/t15-,16-,17-,18-,21-,24-,25-/m0/s1
Reactome pathway
n/an/an/an/a 0.75n/an/an/an/a
McLean Hospital
Curated by ChEMBL
Assay Description
Enhancement of [35S]GTPgammaS binding to human KOR expressed in CHO cells
Bioorg Med Chem Lett 16: 4679-85 (2006)
Article DOI: 10.1016/j.bmcl.2006.05.093
BindingDB Entry DOI: 10.7270/Q2GX4B55