BDBM50189405 CHEMBL3828354
SMILES: COc1ccccc1C(=O)Nc1cc2n(C)c(=O)n(C)c2cc1N1CCN[C@@H](C)C1
InChI Key: InChIKey=UTRHEFRQXSLIOL-AWEZNQCLSA-N
Data: 1 IC50
Activity Spreadsheet -- Enzyme Inhibition Constant Data from BindingDB
Found 1 hit for monomerid = 50189405
Trg + Lig
Ki
nM
ΔG°
kcal/mole
IC50
nM
Kd
nM
EC50/IC50
nM
koff
s-1
kon
M-1s-1
pHTemp
°C
Peregrin
(Homo sapiens (Human))
BDBM50189405
(CHEMBL3828354)
Show SMILES COc1ccccc1C(=O)Nc1cc2n(C)c(=O)n(C)c2cc1N1CCN[C@@H](C)C1 |r|
Show InChI InChI=1S/C22H27N5O3/c1-14-13-27(10-9-23-14)17-12-19-18(25(2)22(29)26(19)3)11-16(17)24-21(28)15-7-5-6-8-20(15)30-4/h5-8,11-12,14,23H,9-10,13H2,1-4H3,(H,24,28)/t14-/m0/s1
n/an/a 79n/an/an/an/an/an/a
GlaxoSmithKline
Curated by ChEMBL
Assay Description
Inhibition of synthetic fluorescent ligand binding to recombinant truncated 6H-Flag-TEV-BRPF1 (622 to 738 residues) (unknown origin) expressed in Esc...
ACS Med Chem Lett 7: 552-7 (2016)
BindingDB Entry DOI: 10.7270/Q2S184G2