BDBM50189411 CHEMBL3827996
SMILES: CC(C)Oc1cc2n(C)c(=O)n(C)c2cc1NC(=O)c1ccccc1OCC(N)=O
InChI Key: InChIKey=QKZDFSGKUSQOBI-UHFFFAOYSA-N
Data: 1 IC50
Activity Spreadsheet -- Enzyme Inhibition Constant Data from BindingDB
Found 1 hit for monomerid = 50189411
Trg + Lig
Ki
nM
ΔG°
kcal/mole
IC50
nM
Kd
nM
EC50/IC50
nM
koff
s-1
kon
M-1s-1
pHTemp
°C
Peregrin
(Homo sapiens (Human))
BDBM50189411
(CHEMBL3827996)
Show SMILES CC(C)Oc1cc2n(C)c(=O)n(C)c2cc1NC(=O)c1ccccc1OCC(N)=O
Show InChI InChI=1S/C21H24N4O5/c1-12(2)30-18-10-16-15(24(3)21(28)25(16)4)9-14(18)23-20(27)13-7-5-6-8-17(13)29-11-19(22)26/h5-10,12H,11H2,1-4H3,(H2,22,26)(H,23,27)
n/an/a 100n/an/an/an/an/an/a
GlaxoSmithKline
Curated by ChEMBL
Assay Description
Inhibition of synthetic fluorescent ligand binding to recombinant truncated 6H-Flag-TEV-BRPF1 (622 to 738 residues) (unknown origin) expressed in Esc...
ACS Med Chem Lett 7: 552-7 (2016)
BindingDB Entry DOI: 10.7270/Q2S184G2