null
SMILES: CNC(=O)c1ccc2cncc(-c3ccc4NS(=O)(=O)Cc4c3)c2n1
InChI Key: InChIKey=PQCODRGUOJKOCC-UHFFFAOYSA-N
Activity Spreadsheet -- Enzyme Inhibition Constant Data from BindingDB
Found 2 hits for monomerid = 50189416
Trg + Lig
Ki
nM
ΔG°
kcal/mole
IC50
nM
Kd
nM
EC50/IC50
nM
koff
s-1
kon
M-1s-1
pHTemp
°C
Cyclin-C
(Homo sapiens (Human))
BDBM50189416
(CHEMBL3828575)
Show SMILES CNC(=O)c1ccc2cncc(-c3ccc4NS(=O)(=O)Cc4c3)c2n1
Show InChI InChI=1S/C17H14N4O3S/c1-18-17(22)15-5-3-11-7-19-8-13(16(11)20-15)10-2-4-14-12(6-10)9-25(23,24)21-14/h2-8,21H,9H2,1H3,(H,18,22)
n/an/a 5.30n/an/an/an/an/an/a
The Institute of Cancer Research
Curated by ChEMBL
Assay Description
Competitive binding affinity to full length His-tagged human recombinant CDK8/cyclin C expressed in baculovirus after 20 mins in presence of Alexa647...
ACS Med Chem Lett 7: 573-8 (2016)
BindingDB Entry DOI: 10.7270/Q2N87CRB
Cyclin-dependent kinase 8
(Homo sapiens (Human))
BDBM50189416
(CHEMBL3828575)
Show SMILES CNC(=O)c1ccc2cncc(-c3ccc4NS(=O)(=O)Cc4c3)c2n1
Show InChI InChI=1S/C17H14N4O3S/c1-18-17(22)15-5-3-11-7-19-8-13(16(11)20-15)10-2-4-14-12(6-10)9-25(23,24)21-14/h2-8,21H,9H2,1H3,(H,18,22)
Reactome pathway
n/an/a 11n/an/an/an/an/an/a
The Institute of Cancer Research
Curated by ChEMBL
Assay Description
Binding affinity to CDK8 (unknown origin) expressed in human 7dF3 cells preincubated for 2 hrs followed by beta-oestradiol addition measured after 24...
ACS Med Chem Lett 7: 573-8 (2016)
BindingDB Entry DOI: 10.7270/Q2N87CRB