null
SMILES: Cn1cc(cn1)-c1ccc(cc1)-c1cncc2ccc(nc12)C(O)=O
InChI Key: InChIKey=WBUMRDJBKJSRQP-UHFFFAOYSA-N
Activity Spreadsheet -- Enzyme Inhibition Constant Data from BindingDB
Found 2 hits for monomerid = 50189418
Trg + Lig
Ki
nM
ΔG°
kcal/mole
IC50
nM
Kd
nM
EC50/IC50
nM
koff
s-1
kon
M-1s-1
pHTemp
°C
Cyclin-C
(Homo sapiens (Human))
BDBM50189418
(CHEMBL3827482)
Show SMILES Cn1cc(cn1)-c1ccc(cc1)-c1cncc2ccc(nc12)C(O)=O
Show InChI InChI=1S/C19H14N4O2/c1-23-11-15(9-21-23)12-2-4-13(5-3-12)16-10-20-8-14-6-7-17(19(24)25)22-18(14)16/h2-11H,1H3,(H,24,25)
n/an/a 4.70n/an/an/an/an/an/a
The Institute of Cancer Research
Curated by ChEMBL
Assay Description
Competitive binding affinity to full length His-tagged human recombinant CDK8/cyclin C expressed in baculovirus after 20 mins in presence of Alexa647...
ACS Med Chem Lett 7: 573-8 (2016)
BindingDB Entry DOI: 10.7270/Q2N87CRB
Cyclin-dependent kinase 8
(Homo sapiens (Human))
BDBM50189418
(CHEMBL3827482)
Show SMILES Cn1cc(cn1)-c1ccc(cc1)-c1cncc2ccc(nc12)C(O)=O
Show InChI InChI=1S/C19H14N4O2/c1-23-11-15(9-21-23)12-2-4-13(5-3-12)16-10-20-8-14-6-7-17(19(24)25)22-18(14)16/h2-11H,1H3,(H,24,25)
Reactome pathway
n/an/a 590n/an/an/an/an/an/a
The Institute of Cancer Research
Curated by ChEMBL
Assay Description
Binding affinity to CDK8 (unknown origin) expressed in human 7dF3 cells preincubated for 2 hrs followed by beta-oestradiol addition measured after 24...
ACS Med Chem Lett 7: 573-8 (2016)
BindingDB Entry DOI: 10.7270/Q2N87CRB