BDBM50189438 CHEMBL3828689
SMILES: Cn1cc(cn1)-c1ccc(cc1)-c1cncc2ccc(cc12)C(=O)N1CC(F)(F)C1
InChI Key: InChIKey=GTJWTPSHGINPNN-UHFFFAOYSA-N
Data: 2 IC50
Activity Spreadsheet -- Enzyme Inhibition Constant Data from BindingDB
Found 2 hits for monomerid = 50189438
Trg + Lig
Ki
nM
ΔG°
kcal/mole
IC50
nM
Kd
nM
EC50/IC50
nM
koff
s-1
kon
M-1s-1
pHTemp
°C
Cyclin-C
(Homo sapiens (Human))
BDBM50189438
(CHEMBL3828689)
Show SMILES Cn1cc(cn1)-c1ccc(cc1)-c1cncc2ccc(cc12)C(=O)N1CC(F)(F)C1
Show InChI InChI=1S/C23H18F2N4O/c1-28-12-19(10-27-28)15-2-4-16(5-3-15)21-11-26-9-18-7-6-17(8-20(18)21)22(30)29-13-23(24,25)14-29/h2-12H,13-14H2,1H3
n/an/a 6.20n/an/an/an/an/an/a
The Institute of Cancer Research
Curated by ChEMBL
Assay Description
Competitive binding affinity to full length His-tagged human recombinant CDK8/cyclin C expressed in baculovirus after 20 mins in presence of Alexa647...
ACS Med Chem Lett 7: 573-8 (2016)
BindingDB Entry DOI: 10.7270/Q2N87CRB
Cyclin-dependent kinase 8
(Homo sapiens (Human))
BDBM50189438
(CHEMBL3828689)
Show SMILES Cn1cc(cn1)-c1ccc(cc1)-c1cncc2ccc(cc12)C(=O)N1CC(F)(F)C1
Show InChI InChI=1S/C23H18F2N4O/c1-28-12-19(10-27-28)15-2-4-16(5-3-15)21-11-26-9-18-7-6-17(8-20(18)21)22(30)29-13-23(24,25)14-29/h2-12H,13-14H2,1H3
Reactome pathway
n/an/a 19n/an/an/an/an/an/a
The Institute of Cancer Research
Curated by ChEMBL
Assay Description
Binding affinity to CDK8 (unknown origin) expressed in human 7dF3 cells preincubated for 2 hrs followed by beta-oestradiol addition measured after 24...
ACS Med Chem Lett 7: 573-8 (2016)
BindingDB Entry DOI: 10.7270/Q2N87CRB