BDBM50189782 CHEMBL3827268
SMILES: CC(Oc1ccc2[nH]nc(-c3nc4cc(ccc4[nH]3)C3CCN(C)CC3)c2c1)c1c(Cl)cncc1Cl
InChI Key: InChIKey=NUMZOUWDKZZHAY-UHFFFAOYSA-N
Data: 2 IC50
Activity Spreadsheet -- Enzyme Inhibition Constant Data from BindingDB
Found 2 hits for monomerid = 50189782
Trg + Lig
Ki
nM
ΔG°
kcal/mole
IC50
nM
Kd
nM
EC50/IC50
nM
koff
s-1
kon
M-1s-1
pHTemp
°C
Fibroblast growth factor receptor 1
(Homo sapiens (Human))
BDBM50189782
(CHEMBL3827268)
Show SMILES CC(Oc1ccc2[nH]nc(-c3nc4cc(ccc4[nH]3)C3CCN(C)CC3)c2c1)c1c(Cl)cncc1Cl
Show InChI InChI=1S/C27H26Cl2N6O/c1-15(25-20(28)13-30-14-21(25)29)36-18-4-6-22-19(12-18)26(34-33-22)27-31-23-5-3-17(11-24(23)32-27)16-7-9-35(2)10-8-16/h3-6,11-16H,7-10H2,1-2H3,(H,31,32)(H,33,34)
NCI pathway
Reactome pathway
n/an/a 1n/an/an/an/an/an/a
East China University of Science& Technology
Curated by ChEMBL
Assay Description
Inhibition of recombinant human FGFR1 using poly (Glu, Tyr) 4:1 as substrate after 60 mins by ELISA
J Med Chem 59: 6690-708 (2016)
BindingDB Entry DOI: 10.7270/Q2474CT3
Vascular endothelial growth factor receptor 2
(Homo sapiens (Human))
BDBM50189782
(CHEMBL3827268)
Show SMILES CC(Oc1ccc2[nH]nc(-c3nc4cc(ccc4[nH]3)C3CCN(C)CC3)c2c1)c1c(Cl)cncc1Cl
Show InChI InChI=1S/C27H26Cl2N6O/c1-15(25-20(28)13-30-14-21(25)29)36-18-4-6-22-19(12-18)26(34-33-22)27-31-23-5-3-17(11-24(23)32-27)16-7-9-35(2)10-8-16/h3-6,11-16H,7-10H2,1-2H3,(H,31,32)(H,33,34)
NCI pathway
Reactome pathway
n/an/a 7.80n/an/an/an/an/an/a
East China University of Science& Technology
Curated by ChEMBL
Assay Description
Inhibition of recombinant human VEGFR2 using poly (Glu, Tyr) 4:1 as substrate after 60 mins by ELISA
J Med Chem 59: 6690-708 (2016)
BindingDB Entry DOI: 10.7270/Q2474CT3