BDBM50189789 CHEMBL3827165
SMILES: Clc1cnccc1COc1ccc2[nH]nc(-c3nc4cc(ccc4[nH]3)N3CCCCC3)c2c1
InChI Key: InChIKey=ZXCOSHSIMXFWIC-UHFFFAOYSA-N
Data: 1 IC50
Activity Spreadsheet -- Enzyme Inhibition Constant Data from BindingDB
Found 1 hit for monomerid = 50189789
Trg + Lig
Ki
nM
ΔG°
kcal/mole
IC50
nM
Kd
nM
EC50/IC50
nM
koff
s-1
kon
M-1s-1
pHTemp
°C
Fibroblast growth factor receptor 1
(Homo sapiens (Human))
BDBM50189789
(CHEMBL3827165)
Show SMILES Clc1cnccc1COc1ccc2[nH]nc(-c3nc4cc(ccc4[nH]3)N3CCCCC3)c2c1
Show InChI InChI=1S/C25H23ClN6O/c26-20-14-27-9-8-16(20)15-33-18-5-7-21-19(13-18)24(31-30-21)25-28-22-6-4-17(12-23(22)29-25)32-10-2-1-3-11-32/h4-9,12-14H,1-3,10-11,15H2,(H,28,29)(H,30,31)
NCI pathway
Reactome pathway
n/an/a 14n/an/an/an/an/an/a
East China University of Science& Technology
Curated by ChEMBL
Assay Description
Inhibition of recombinant human FGFR1 using poly (Glu, Tyr) 4:1 as substrate after 60 mins by ELISA
J Med Chem 59: 6690-708 (2016)
BindingDB Entry DOI: 10.7270/Q2474CT3