BDBM50189794 CHEMBL3827608
SMILES: CCC(Oc1ccc2[nH]nc(-c3nc4cc(ccc4[nH]3)N3CCCCC3)c2c1)c1c(Cl)cncc1Cl
InChI Key: InChIKey=WZPUHLVKYQFUJW-UHFFFAOYSA-N
Data: 1 IC50
Activity Spreadsheet -- Enzyme Inhibition Constant Data from BindingDB
Found 1 hit for monomerid = 50189794
Trg + Lig
Ki
nM
ΔG°
kcal/mole
IC50
nM
Kd
nM
EC50/IC50
nM
koff
s-1
kon
M-1s-1
pHTemp
°C
Fibroblast growth factor receptor 1
(Homo sapiens (Human))
BDBM50189794
(CHEMBL3827608)
Show SMILES CCC(Oc1ccc2[nH]nc(-c3nc4cc(ccc4[nH]3)N3CCCCC3)c2c1)c1c(Cl)cncc1Cl
Show InChI InChI=1S/C27H26Cl2N6O/c1-2-24(25-19(28)14-30-15-20(25)29)36-17-7-9-21-18(13-17)26(34-33-21)27-31-22-8-6-16(12-23(22)32-27)35-10-4-3-5-11-35/h6-9,12-15,24H,2-5,10-11H2,1H3,(H,31,32)(H,33,34)
NCI pathway
Reactome pathway
n/an/a 5.70n/an/an/an/an/an/a
East China University of Science& Technology
Curated by ChEMBL
Assay Description
Inhibition of recombinant human FGFR1 using poly (Glu, Tyr) 4:1 as substrate after 60 mins by ELISA
J Med Chem 59: 6690-708 (2016)
BindingDB Entry DOI: 10.7270/Q2474CT3