BDBM50189858 CHEMBL434553::{[(2R,3R,4R,5R)-5-(6-amino-9H-purin-9-yl)-4-[({[(2R,3S,4R,5R)-5-(6-amino-9H-purin-9-yl)-4-[({[(2R,3S,4R,5R)-5-(6-amino-9H-purin-9-yl)-4-[({[(2R,3R,4R,5R)-5-(6-amino-9H-purin-9-yl)-3-hydroxy-4-(phosphonooxy)oxolan-2-yl]methoxy}(hydroxy)phosphoryl)oxy]-3-hydroxyoxolan-2-yl]methoxy}(hydroxy)phosphoryl)oxy]-3-hydroxyoxolan-2-yl]methoxy}(hydroxy)phosphoryl)oxy]-3-hydroxyoxolan-2-yl]methoxy}phosphonic acid
SMILES: Nc1ncnc2n(cnc12)[C@@H]1O[C@H](COP(O)(=O)O[C@@H]2[C@@H](O)[C@@H](COP(O)(=O)O[C@@H]3[C@@H](O)[C@@H](COP(O)(=O)O[C@@H]4[C@H](O)[C@@H](COP(O)(O)=O)O[C@H]4n4cnc5c(N)ncnc45)O[C@H]3n3cnc4c(N)ncnc34)O[C@H]2n2cnc3c(N)ncnc23)[C@@H](O)[C@H]1OP(O)(O)=O
InChI Key: InChIKey=ARWCLLJIZYWWEN-MPROOKIHSA-N
Data: 1 EC50
Activity Spreadsheet -- Enzyme Inhibition Constant Data from BindingDB
Found 1 hit for monomerid = 50189858
Trg + Lig
Ki
nM
ΔG°
kcal/mole
IC50
nM
Kd
nM
EC50/IC50
nM
koff
s-1
kon
M-1s-1
pHTemp
°C
RNase L
(Mus musculus)
BDBM50189858
(CHEMBL434553 | {[(2R,3R,4R,5R)-5-(6-amino-9H-purin...)
Show SMILES Nc1ncnc2n(cnc12)[C@@H]1O[C@H](COP(O)(=O)O[C@@H]2[C@@H](O)[C@@H](COP(O)(=O)O[C@@H]3[C@@H](O)[C@@H](COP(O)(=O)O[C@@H]4[C@H](O)[C@@H](COP(O)(O)=O)O[C@H]4n4cnc5c(N)ncnc45)O[C@H]3n3cnc4c(N)ncnc34)O[C@H]2n2cnc3c(N)ncnc23)[C@@H](O)[C@H]1OP(O)(O)=O
Show InChI InChI=1S/C40H51N20O28P5/c41-29-17-33(49-5-45-29)57(9-53-17)37-25(85-90(68,69)70)21(61)14(82-37)2-78-91(71,72)87-27-23(63)16(84-39(27)59-11-55-19-31(43)47-7-51-35(19)59)4-80-93(75,76)88-28-24(64)15(83-40(28)60-12-56-20-32(44)48-8-52-36(20)60)3-79-92(73,74)86-26-22(62)13(1-77-89(65,66)67)81-38(26)58-10-54-18-30(42)46-6-50-34(18)58/h5-16,21-28,37-40,61-64H,1-4H2,(H,71,72)(H,73,74)(H,75,76)(H2,41,45,49)(H2,42,46,50)(H2,43,47,51)(H2,44,48,52)(H2,65,66,67)(H2,68,69,70)/t13-,14-,15-,16-,21-,22-,23+,24+,25-,26-,27-,28-,37-,38-,39-,40-/m1/s1
n/an/an/an/a 393n/an/an/an/a
Academy of Sciences of the Czech Republic
Curated by ChEMBL
Assay Description
Activation of mouse RNase L assessed as ability to cleave 5'-[32P]r(C11U2C7)
J Med Chem 49: 3955-62 (2006)
Article DOI: 10.1021/jm050401v
BindingDB Entry DOI: 10.7270/Q2X066N8