BDBM50189982 2-[1-(3,4,5-trimethoxybenzoyl)naphthalene-2-yloxy]-ethylethanoate::CHEMBL215401
SMILES: CCOC(=O)COc1ccc2ccccc2c1C(=O)c1cc(OC)c(OC)c(OC)c1
InChI Key: InChIKey=YKALXIBBZZOQDQ-UHFFFAOYSA-N
Data: 1 IC50
Activity Spreadsheet -- Enzyme Inhibition Constant Data from BindingDB
Found 1 hit for monomerid = 50189982
Trg + Lig
Ki
nM
ΔG°
kcal/mole
IC50
nM
Kd
nM
EC50/IC50
nM
koff
s-1
kon
M-1s-1
pHTemp
°C
Cathepsin D
(Homo sapiens (Human))
BDBM50189982
(2-[1-(3,4,5-trimethoxybenzoyl)naphthalene-2-yloxy]...)
Show SMILES CCOC(=O)COc1ccc2ccccc2c1C(=O)c1cc(OC)c(OC)c(OC)c1
Show InChI InChI=1S/C24H24O7/c1-5-30-21(25)14-31-18-11-10-15-8-6-7-9-17(15)22(18)23(26)16-12-19(27-2)24(29-4)20(13-16)28-3/h6-13H,5,14H2,1-4H3
NCI pathway
Reactome pathway
n/an/a>1.00E+6n/an/an/an/an/an/a
Institute of Medicinal and Aromatic Plants
Curated by ChEMBL
Assay Description
Inhibition of human cathepsin D
Bioorg Med Chem Lett 16: 4603-8 (2006)
Article DOI: 10.1016/j.bmcl.2006.06.010
BindingDB Entry DOI: 10.7270/Q2FB53QN