BDBM50190154 CHEMBL3827723
SMILES: CC(OC[C@H](O)CNC(C)(C)Cc1ccc2ccccc2c1)c1ccc(C)c2OC3C(C3c12)C(O)=O
InChI Key: InChIKey=QRDZUSAQYVDCFV-QWNSMCCGSA-N
Data: 1 IC50
Activity Spreadsheet -- Enzyme Inhibition Constant Data from BindingDB
Found 1 hit for monomerid = 50190154
Trg + Lig
Ki
nM
ΔG°
kcal/mole
IC50
nM
Kd
nM
EC50/IC50
nM
koff
s-1
kon
M-1s-1
pHTemp
°C
Calcium-sensing receptor (CaSR)
(Homo sapiens (Human))
BDBM50190154
(CHEMBL3827723)
Show SMILES CC(OC[C@H](O)CNC(C)(C)Cc1ccc2ccccc2c1)c1ccc(C)c2OC3C(C3c12)C(O)=O |r|
Show InChI InChI=1S/C30H35NO5/c1-17-9-12-23(24-25-26(29(33)34)28(25)36-27(17)24)18(2)35-16-22(32)15-31-30(3,4)14-19-10-11-20-7-5-6-8-21(20)13-19/h5-13,18,22,25-26,28,31-32H,14-16H2,1-4H3,(H,33,34)/t18?,22-,25?,26?,28?/m1/s1
n/an/a 64n/an/an/an/an/an/a
Merck Research Laboratories
Curated by ChEMBL
Assay Description
Antagonist activity at calcium sensing receptor (unknown origin) by cell based FLIPR assay
Bioorg Med Chem Lett 26: 4077-80 (2016)
BindingDB Entry DOI: 10.7270/Q29S1SZS