BDBM50190156 CHEMBL3828154
SMILES: [H][C@@]12Oc3c(c(ccc3C)[C@@H](C)OC[C@H](O)CNC(C)(C)CC3Cc4ccccc4C3)[C@]1([H])[C@H]2C(O)=O
InChI Key: InChIKey=YQVJDUNPTRCCKN-UYMRTCKISA-N
Data: 1 IC50
Activity Spreadsheet -- Enzyme Inhibition Constant Data from BindingDB
Found 1 hit for monomerid = 50190156
Trg + Lig
Ki
nM
ΔG°
kcal/mole
IC50
nM
Kd
nM
EC50/IC50
nM
koff
s-1
kon
M-1s-1
pHTemp
°C
Calcium-sensing receptor (CaSR)
(Homo sapiens (Human))
BDBM50190156
(CHEMBL3828154)
Show SMILES [H][C@@]12Oc3c(c(ccc3C)[C@@H](C)OC[C@H](O)CNC(C)(C)CC3Cc4ccccc4C3)[C@]1([H])[C@H]2C(O)=O |r|
Show InChI InChI=1S/C29H37NO5/c1-16-9-10-22(23-24-25(28(32)33)27(24)35-26(16)23)17(2)34-15-21(31)14-30-29(3,4)13-18-11-19-7-5-6-8-20(19)12-18/h5-10,17-18,21,24-25,27,30-31H,11-15H2,1-4H3,(H,32,33)/t17-,21-,24-,25-,27-/m1/s1
n/an/a 46n/an/an/an/an/an/a
Merck Research Laboratories
Curated by ChEMBL
Assay Description
Antagonist activity at calcium sensing receptor (unknown origin) by cell based FLIPR assay
Bioorg Med Chem Lett 26: 4077-80 (2016)
BindingDB Entry DOI: 10.7270/Q29S1SZS