null
SMILES: CC(=O)NS(=O)(=O)c1ccc(NCc2cnc3nc(N)[nH]c(=O)c3n2)cc1
InChI Key: InChIKey=IFXPLBJPAQFDLV-UHFFFAOYSA-N
Activity Spreadsheet -- Enzyme Inhibition Constant Data from BindingDB
Found 2 hits for monomerid = 50190585
Trg + Lig
Ki
nM
ΔG°
kcal/mole
IC50
nM
Kd
nM
EC50/IC50
nM
koff
s-1
kon
M-1s-1
pHTemp
°C
Dihydropteroate synthase
(Bacillus anthracis)
BDBM50190585
(CHEMBL3828540)
Show SMILES CC(=O)NS(=O)(=O)c1ccc(NCc2cnc3nc(N)[nH]c(=O)c3n2)cc1
Show InChI InChI=1S/C15H15N7O4S/c1-8(23)22-27(25,26)11-4-2-9(3-5-11)17-6-10-7-18-13-12(19-10)14(24)21-15(16)20-13/h2-5,7,17H,6H2,1H3,(H,22,23)(H3,16,18,20,21,24)
n/an/a 1.71E+4n/an/an/an/an/an/a
St. Jude Children's Research Hospital
Curated by ChEMBL
Assay Description
Inhibition of fluorescein-labeled probe binding to Bacillus anthracis N-terminal His-tagged DHPS incubated for 1 hr in presence of sodium pyrophospha...
Bioorg Med Chem Lett 26: 3950-4 (2016)
Article DOI: 10.1016/j.bmcl.2016.07.006
BindingDB Entry DOI: 10.7270/Q2P2712G
Dihydropteroate synthase
(Bacillus anthracis)
BDBM50190585
(CHEMBL3828540)
Show SMILES CC(=O)NS(=O)(=O)c1ccc(NCc2cnc3nc(N)[nH]c(=O)c3n2)cc1
Show InChI InChI=1S/C15H15N7O4S/c1-8(23)22-27(25,26)11-4-2-9(3-5-11)17-6-10-7-18-13-12(19-10)14(24)21-15(16)20-13/h2-5,7,17H,6H2,1H3,(H,22,23)(H3,16,18,20,21,24)
n/an/a 1.86E+4n/an/an/an/an/an/a
St. Jude Children's Research Hospital
Curated by ChEMBL
Assay Description
Inhibition of fluorescein-labeled probe binding to Bacillus anthracis N-terminal His-tagged DHPS incubated for 1 hr by fluorescence polarization assa...
Bioorg Med Chem Lett 26: 3950-4 (2016)
Article DOI: 10.1016/j.bmcl.2016.07.006
BindingDB Entry DOI: 10.7270/Q2P2712G