BDBM50190618 CHEMBL3827019
SMILES: Cc1cc(C)c(C)c(c1C)S(=O)(=O)Nc1ccc(N2CCC(C2)C(O)=O)c2ccccc12
InChI Key: InChIKey=BVYWIQHJXAEJOD-UHFFFAOYSA-N
Data: 1 IC50
PDB links: 1 PDB ID matches this monomer.
Activity Spreadsheet -- Enzyme Inhibition Constant Data from BindingDB
Found 1 hit for monomerid = 50190618
Trg + Lig
Ki
nM
ΔG°
kcal/mole
IC50
nM
Kd
nM
EC50/IC50
nM
koff
s-1
kon
M-1s-1
pHTemp
°C
Kelch-like ECH-associated protein 1
(Homo sapiens (Human))
BDBM50190618
(CHEMBL3827019)
Show SMILES Cc1cc(C)c(C)c(c1C)S(=O)(=O)Nc1ccc(N2CCC(C2)C(O)=O)c2ccccc12
Show InChI InChI=1S/C25H28N2O4S/c1-15-13-16(2)18(4)24(17(15)3)32(30,31)26-22-9-10-23(21-8-6-5-7-20(21)22)27-12-11-19(14-27)25(28)29/h5-10,13,19,26H,11-12,14H2,1-4H3,(H,28,29)
n/an/a 200n/an/an/an/an/an/a
Therachem Research Medilab (India) Pvt. Ltd.
Curated by ChEMBL
Assay Description
Inhibition of human Keap1 kelch domain (Ala321 to Thr609 residues) binding to fluorescent labeled Nrf2 peptide preincubated for 15 mins followed by N...
ACS Med Chem Lett 7: 660-1 (2016)
BindingDB Entry DOI: 10.7270/Q2J96899
3D
3D Structure (crystal)