BDBM50190619 CHEMBL3827086::US10870625, Compound 14
SMILES: CCc1nc(N)nc(N)c1C#CCc1cc(ccc1OC)-c1ccccc1C(O)=O
InChI Key: InChIKey=MUUCGSVEZHLUSR-UHFFFAOYSA-N
Data: 3 KI  1 IC50
Activity Spreadsheet -- Enzyme Inhibition Constant Data from BindingDB
Found 4 hits for monomerid = 50190619
Trg + Lig
Ki
nM
ΔG°
kcal/mole
IC50
nM
Kd
nM
EC50/IC50
nM
koff
s-1
kon
M-1s-1
pHTemp
°C
Dihydrofolate reductase
(Escherichia coli)
BDBM50190619
(CHEMBL3827086 | US10870625, Compound 14)
Show SMILES CCc1nc(N)nc(N)c1C#CCc1cc(ccc1OC)-c1ccccc1C(O)=O
Show InChI InChI=1S/C23H22N4O3/c1-3-19-18(21(24)27-23(25)26-19)10-6-7-15-13-14(11-12-20(15)30-2)16-8-4-5-9-17(16)22(28)29/h4-5,8-9,11-13H,3,7H2,1-2H3,(H,28,29)(H4,24,25,26,27)
NCI pathway
Reactome pathway
2.10n/an/an/an/an/an/an/an/a
University of Connecticut
Curated by ChEMBL
Assay Description
Inhibition of recombinant Escherichia coli DHFR expressed in Escherichia coli BL21(DE3) cells assessed as reduction in NADPH oxidation using dihydrof...
ACS Med Chem Lett 7: 692-6 (2016)
BindingDB Entry DOI: 10.7270/Q2DJ5HKK
Dihydrofolate Reductase (DHFR)
(Staphylococcus aureus)
BDBM50190619
(CHEMBL3827086 | US10870625, Compound 14)
Show SMILES CCc1nc(N)nc(N)c1C#CCc1cc(ccc1OC)-c1ccccc1C(O)=O
Show InChI InChI=1S/C23H22N4O3/c1-3-19-18(21(24)27-23(25)26-19)10-6-7-15-13-14(11-12-20(15)30-2)16-8-4-5-9-17(16)22(28)29/h4-5,8-9,11-13H,3,7H2,1-2H3,(H,28,29)(H4,24,25,26,27)
53n/an/an/an/an/an/an/an/a
University of Connecticut
Curated by ChEMBL
Assay Description
Inhibition of recombinant Staphylococcus aureus DHFR expressed in Escherichia coli BL21(DE3) cells assessed as reduction in NADPH oxidation using dih...
ACS Med Chem Lett 7: 692-6 (2016)
BindingDB Entry DOI: 10.7270/Q2DJ5HKK
Dihydrofolate reductase
(Homo sapiens (Human))
BDBM50190619
(CHEMBL3827086 | US10870625, Compound 14)
Show SMILES CCc1nc(N)nc(N)c1C#CCc1cc(ccc1OC)-c1ccccc1C(O)=O
Show InChI InChI=1S/C23H22N4O3/c1-3-19-18(21(24)27-23(25)26-19)10-6-7-15-13-14(11-12-20(15)30-2)16-8-4-5-9-17(16)22(28)29/h4-5,8-9,11-13H,3,7H2,1-2H3,(H,28,29)(H4,24,25,26,27)
NCI pathway
Reactome pathway
2.50E+3n/an/an/an/an/an/an/an/a
University of Connecticut
Curated by ChEMBL
Assay Description
Inhibition of recombinant human DHFR assessed as reduction in NADPH oxidation using dihydrofolate as substrate preincubated for 5 mins followed by su...
ACS Med Chem Lett 7: 692-6 (2016)
BindingDB Entry DOI: 10.7270/Q2DJ5HKK
Dihydrofolate reductase
(Homo sapiens (Human))
BDBM50190619
(CHEMBL3827086 | US10870625, Compound 14)
Show SMILES CCc1nc(N)nc(N)c1C#CCc1cc(ccc1OC)-c1ccccc1C(O)=O
Show InChI InChI=1S/C23H22N4O3/c1-3-19-18(21(24)27-23(25)26-19)10-6-7-15-13-14(11-12-20(15)30-2)16-8-4-5-9-17(16)22(28)29/h4-5,8-9,11-13H,3,7H2,1-2H3,(H,28,29)(H4,24,25,26,27)
NCI pathway
Reactome pathway
US Patent
n/an/a 1.58E+3n/an/an/an/an/an/a
UNIVERSITY OF CONNECTICUT
US Patent
Assay Description
Enzyme activity and inhibition assays were performed by monitoring the NADPH-dependent reduction of dihydrofolate catalyzed by the DHFR enzyme. The r...
US Patent US10870625 (2020)