BDBM50190808 CHEMBL3903767
SMILES: Fc1cccc(c1)-n1nc(C(=O)Nc2ccc(Oc3ccncc3-c3cccnc3)c(F)c2)c2ccccc2c1=O
InChI Key: InChIKey=UHARDQIBCMVSJY-UHFFFAOYSA-N
Data: 1 IC50
Activity Spreadsheet -- Enzyme Inhibition Constant Data from BindingDB
Found 1 hit for monomerid = 50190808
Trg + Lig
Ki
nM
ΔG°
kcal/mole
IC50
nM
Kd
nM
EC50/IC50
nM
koff
s-1
kon
M-1s-1
pHTemp
°C
Hepatocyte growth factor receptor
(Homo sapiens (Human))
BDBM50190808
(CHEMBL3903767)
Show SMILES Fc1cccc(c1)-n1nc(C(=O)Nc2ccc(Oc3ccncc3-c3cccnc3)c(F)c2)c2ccccc2c1=O
Show InChI InChI=1S/C31H19F2N5O3/c32-20-6-3-7-22(15-20)38-31(40)24-9-2-1-8-23(24)29(37-38)30(39)36-21-10-11-28(26(33)16-21)41-27-12-14-35-18-25(27)19-5-4-13-34-17-19/h1-18H,(H,36,39)
n/an/a 19n/an/an/an/an/an/a
Shenyang Pharmaceutical University
Curated by ChEMBL
Assay Description
Inhibition of c-Met (unknown origin) using poly (Glu, Tyr) 4:1 as substrate after 30 mins by HTRF assay
Eur J Med Chem 120: 37-50 (2016)
BindingDB Entry DOI: 10.7270/Q2VM4F5Q