BDBM50190912 CHEMBL3945597
SMILES: Fc1ccc(Nc2cc(Nc3ccc(Oc4ccncc4-c4cccnc4)c(F)c3)ncn2)cc1F
InChI Key: InChIKey=OVOOIGVWCJTUHT-UHFFFAOYSA-N
Data: 1 IC50
Activity Spreadsheet -- Enzyme Inhibition Constant Data from BindingDB
Found 1 hit for monomerid = 50190912
Trg + Lig
Ki
nM
ΔG°
kcal/mole
IC50
nM
Kd
nM
EC50/IC50
nM
koff
s-1
kon
M-1s-1
pHTemp
°C
Hepatocyte growth factor receptor
(Homo sapiens (Human))
BDBM50190912
(CHEMBL3945597)
Show SMILES Fc1ccc(Nc2cc(Nc3ccc(Oc4ccncc4-c4cccnc4)c(F)c3)ncn2)cc1F
Show InChI InChI=1S/C26H17F3N6O/c27-20-5-3-17(10-21(20)28)34-25-12-26(33-15-32-25)35-18-4-6-24(22(29)11-18)36-23-7-9-31-14-19(23)16-2-1-8-30-13-16/h1-15H,(H2,32,33,34,35)
n/an/a 38n/an/an/an/an/an/a
Shenyang Pharmaceutical University
Curated by ChEMBL
Assay Description
Inhibition of c-Met (unknown origin) using poly (Glu, Tyr) 4:1 as substrate after 30 mins by HTRF assay
Eur J Med Chem 120: 37-50 (2016)
BindingDB Entry DOI: 10.7270/Q2VM4F5Q