null
SMILES: CN([C@H]1CCN(C1)C(=O)N1CC[C@H](C1)NC1CCC(C)(C)CC1)C(=O)c1ccc(s1)-c1ccc(C)cc1
InChI Key: InChIKey=IYAIXFTUGYGMST-RPBOFIJWSA-N
Activity Spreadsheet -- Enzyme Inhibition Constant Data from BindingDB
Found 2 hits for monomerid = 50190948
Trg + Lig
Ki
nM
ΔG°
kcal/mole
IC50
nM
Kd
nM
EC50/IC50
nM
koff
s-1
kon
M-1s-1
pHTemp
°C
Melanin-concentrating hormone receptor 1
(Homo sapiens (Human))
BDBM50190948
(CHEMBL442064 | N-((S)-1-((R)-3-(4,4-dimethylcycloh...)
Show SMILES CN([C@H]1CCN(C1)C(=O)N1CC[C@H](C1)NC1CCC(C)(C)CC1)C(=O)c1ccc(s1)-c1ccc(C)cc1
Show InChI InChI=1S/C30H42N4O2S/c1-21-5-7-22(8-6-21)26-9-10-27(37-26)28(35)32(4)25-14-18-34(20-25)29(36)33-17-13-24(19-33)31-23-11-15-30(2,3)16-12-23/h5-10,23-25,31H,11-20H2,1-4H3/t24-,25+/m1/s1
Reactome pathway
1.60n/an/an/an/an/an/an/an/a
Neurocrine Biosciences Inc.
Curated by ChEMBL
Assay Description
Binding affinity to MCHR1 by competitive binding assay
Bioorg Med Chem Lett 16: 4922-30 (2006)
Article DOI: 10.1016/j.bmcl.2006.06.049
BindingDB Entry DOI: 10.7270/Q2TM7BX5
Cytochrome P450 2D6
(Homo sapiens (Human))
BDBM50190948
(CHEMBL442064 | N-((S)-1-((R)-3-(4,4-dimethylcycloh...)
Show SMILES CN([C@H]1CCN(C1)C(=O)N1CC[C@H](C1)NC1CCC(C)(C)CC1)C(=O)c1ccc(s1)-c1ccc(C)cc1
Show InChI InChI=1S/C30H42N4O2S/c1-21-5-7-22(8-6-21)26-9-10-27(37-26)28(35)32(4)25-14-18-34(20-25)29(36)33-17-13-24(19-33)31-23-11-15-30(2,3)16-12-23/h5-10,23-25,31H,11-20H2,1-4H3/t24-,25+/m1/s1
n/an/a 3.50E+3n/an/an/an/an/an/a
Neurocrine Biosciences Inc.
Curated by ChEMBL
Assay Description
Inhibition of CYP2D6
Bioorg Med Chem Lett 16: 4922-30 (2006)
Article DOI: 10.1016/j.bmcl.2006.06.049
BindingDB Entry DOI: 10.7270/Q2TM7BX5