BDBM50191054 3-amino-N-(1-phenethylpiperidin-4-yl)-N-phenylpropanamide::CHEMBL385168
SMILES: NCCC(=O)N(C1CCN(CCc2ccccc2)CC1)c1ccccc1
InChI Key: InChIKey=WBHIZNRNVFOZMJ-UHFFFAOYSA-N
Data: 2 IC50
Activity Spreadsheet -- Enzyme Inhibition Constant Data from BindingDB
Found 2 hits for monomerid = 50191054
Trg + Lig
Ki
nM
ΔG°
kcal/mole
IC50
nM
Kd
nM
EC50/IC50
nM
koff
s-1
kon
M-1s-1
pHTemp
°C
Mu-type opioid receptor
(Rattus norvegicus (rat))
BDBM50191054
(3-amino-N-(1-phenethylpiperidin-4-yl)-N-phenylprop...)
Show SMILES NCCC(=O)N(C1CCN(CCc2ccccc2)CC1)c1ccccc1
Show InChI InChI=1S/C22H29N3O/c23-15-11-22(26)25(20-9-5-2-6-10-20)21-13-17-24(18-14-21)16-12-19-7-3-1-4-8-19/h1-10,21H,11-18,23H2
Reactome pathway
n/an/a 2.08E+3n/an/an/an/an/an/a
University of Arizona
Curated by ChEMBL
Assay Description
Displacement of [3H]DAMGO from rat mu opioid receptor
Bioorg Med Chem Lett 16: 4946-50 (2006)
Article DOI: 10.1016/j.bmcl.2006.06.040
BindingDB Entry DOI: 10.7270/Q24B30Z0
Delta-type opioid receptor
(Homo sapiens (Human))
BDBM50191054
(3-amino-N-(1-phenethylpiperidin-4-yl)-N-phenylprop...)
Show SMILES NCCC(=O)N(C1CCN(CCc2ccccc2)CC1)c1ccccc1
Show InChI InChI=1S/C22H29N3O/c23-15-11-22(26)25(20-9-5-2-6-10-20)21-13-17-24(18-14-21)16-12-19-7-3-1-4-8-19/h1-10,21H,11-18,23H2
Reactome pathway
n/an/a 1.30E+4n/an/an/an/an/an/a
University of Arizona
Curated by ChEMBL
Assay Description
Displacement of [3H]DPDPE from human delta opioid receptor
Bioorg Med Chem Lett 16: 4946-50 (2006)
Article DOI: 10.1016/j.bmcl.2006.06.040
BindingDB Entry DOI: 10.7270/Q24B30Z0