BDBM50191087 (1R,2S,3S)-3-((R)-1-(3,5-bis(trifluoromethyl)phenyl)ethoxy)-N-((4H-1,2,4-triazol-3-yl)methyl)-N-ethyl-2-(4-fluorophenyl)cyclopentanamine::CHEMBL380210
SMILES: CCN(Cc1nnc[nH]1)[C@@H]1CC[C@H](O[C@H](C)c2cc(cc(c2)C(F)(F)F)C(F)(F)F)[C@H]1c1ccc(F)cc1
InChI Key: InChIKey=LODDXUXHYQZBEM-LMIIYESCSA-N
Data: 1 IC50
Activity Spreadsheet -- Enzyme Inhibition Constant Data from BindingDB
Found 1 hit for monomerid = 50191087
Trg + Lig
Ki
nM
ΔG°
kcal/mole
IC50
nM
Kd
nM
EC50/IC50
nM
koff
s-1
kon
M-1s-1
pHTemp
°C
Neurokinin 1 receptor
(Homo sapiens (Human))
BDBM50191087
((1R,2S,3S)-3-((R)-1-(3,5-bis(trifluoromethyl)pheny...)
Show SMILES CCN(Cc1nnc[nH]1)[C@@H]1CC[C@H](O[C@H](C)c2cc(cc(c2)C(F)(F)F)C(F)(F)F)[C@H]1c1ccc(F)cc1
Show InChI InChI=1S/C26H27F7N4O/c1-3-37(13-23-34-14-35-36-23)21-8-9-22(24(21)16-4-6-20(27)7-5-16)38-15(2)17-10-18(25(28,29)30)12-19(11-17)26(31,32)33/h4-7,10-12,14-15,21-22,24H,3,8-9,13H2,1-2H3,(H,34,35,36)/t15-,21-,22+,24+/m1/s1
Reactome pathway
n/an/a 0.160n/an/an/an/an/an/a
Merck Research Laboratories
Curated by ChEMBL
Assay Description
Displacement of [125I]SP from human cloned NK1 receptor expressed in CHO cells
Bioorg Med Chem Lett 16: 4504-11 (2006)
Article DOI: 10.1016/j.bmcl.2006.06.044
BindingDB Entry DOI: 10.7270/Q20P0ZM5