BDBM50191092 (1R,2S,3S)-3-((R)-1-(3,5-bis(trifluoromethyl)phenyl)ethoxy)-N-((4H-1,2,4-triazol-3-yl)methyl)-2-(4-fluorophenyl)-N-methylcyclopentanamine::CHEMBL384171
SMILES: C[C@@H](O[C@H]1CC[C@H]([C@@H]1c1ccc(F)cc1)N(C)Cc1nnc[nH]1)c1cc(cc(c1)C(F)(F)F)C(F)(F)F
InChI Key: InChIKey=DWOYLZPGCVPOFQ-XGXIMLBESA-N
Data: 1 IC50
Activity Spreadsheet -- Enzyme Inhibition Constant Data from BindingDB
Found 1 hit for monomerid = 50191092
Trg + Lig
Ki
nM
ΔG°
kcal/mole
IC50
nM
Kd
nM
EC50/IC50
nM
koff
s-1
kon
M-1s-1
pHTemp
°C
Neurokinin 1 receptor
(Homo sapiens (Human))
BDBM50191092
((1R,2S,3S)-3-((R)-1-(3,5-bis(trifluoromethyl)pheny...)
Show SMILES C[C@@H](O[C@H]1CC[C@H]([C@@H]1c1ccc(F)cc1)N(C)Cc1nnc[nH]1)c1cc(cc(c1)C(F)(F)F)C(F)(F)F
Show InChI InChI=1S/C25H25F7N4O/c1-14(16-9-17(24(27,28)29)11-18(10-16)25(30,31)32)37-21-8-7-20(36(2)12-22-33-13-34-35-22)23(21)15-3-5-19(26)6-4-15/h3-6,9-11,13-14,20-21,23H,7-8,12H2,1-2H3,(H,33,34,35)/t14-,20-,21+,23+/m1/s1
Reactome pathway
n/an/a 0.160n/an/an/an/an/an/a
Merck Research Laboratories
Curated by ChEMBL
Assay Description
Displacement of [125I]SP from human cloned NK1 receptor expressed in CHO cells
Bioorg Med Chem Lett 16: 4504-11 (2006)
Article DOI: 10.1016/j.bmcl.2006.06.044
BindingDB Entry DOI: 10.7270/Q20P0ZM5