BDBM50191276 CHEMBL2346938
SMILES: Cl.NC(=N)N\N=C\c1cccc2ccccc12
InChI Key: InChIKey=PSHSAVHKEOGWPS-TWNLEINFSA-N
Data: 1 IC50  1 Kd
Activity Spreadsheet -- Enzyme Inhibition Constant Data from BindingDB
Found 2 hits for monomerid = 50191276
Trg + Lig
Ki
nM
ΔG°
kcal/mole
IC50
nM
Kd
nM
EC50/IC50
nM
koff
s-1
kon
M-1s-1
pHTemp
°C
NMDA receptor subtype 2A protein (NR2A)
(Homo sapiens (Human))
BDBM50191276
(CHEMBL2346938)
Show SMILES Cl.NC(=N)N\N=C\c1cccc2ccccc12
Show InChI InChI=1S/C12H12N4.ClH/c13-12(14)16-15-8-10-6-3-5-9-4-1-2-7-11(9)10;/h1-8H,(H4,13,14,16);1H/b15-8+;
n/an/a 2.69E+4n/an/an/an/an/an/a
University of Kentucky
Curated by ChEMBL
Assay Description
Displacement of [3H]MK-801 from NMDA receptor complex (unknown origin) after 40 mins
Bioorg Med Chem 21: 1764-74 (2013)
Article DOI: 10.1016/j.bmc.2013.01.051
BindingDB Entry DOI: 10.7270/Q2M048CZ
Heme oxygenase
(Pseudomonas aeruginosa)
BDBM50191276
(CHEMBL2346938)
Show SMILES Cl.NC(=N)N\N=C\c1cccc2ccccc12
Show InChI InChI=1S/C12H12N4.ClH/c13-12(14)16-15-8-10-6-3-5-9-4-1-2-7-11(9)10;/h1-8H,(H4,13,14,16);1H/b15-8+;
n/an/an/a 1.20E+4n/an/an/an/an/a
University of Maryland
Curated by ChEMBL
Assay Description
Binding affinity to Pseudomonas aeruginosa HemO by intrinsic fluorescence quenching method
J Med Chem 59: 6929-42 (2016)
BindingDB Entry DOI: 10.7270/Q26W9D18