BDBM50191303 Amino(2-(4-Isopropylbenzylidene)Hydrazinyl)Methaniminium Chloride::CHEMBL2346953
SMILES: Cl.CC(C)c1ccc(\C=N\NC(N)=N)cc1
InChI Key: InChIKey=KRWUGYXMXJBFQU-FJUODKGNSA-N
Data: 1 IC50  1 Kd
Activity Spreadsheet -- Enzyme Inhibition Constant Data from BindingDB
Found 2 hits for monomerid = 50191303
Trg + Lig
Ki
nM
ΔG°
kcal/mole
IC50
nM
Kd
nM
EC50/IC50
nM
koff
s-1
kon
M-1s-1
pHTemp
°C
NMDA receptor subtype 2A protein (NR2A)
(Homo sapiens (Human))
BDBM50191303
(Amino(2-(4-Isopropylbenzylidene)Hydrazinyl)Methani...)
Show SMILES Cl.CC(C)c1ccc(\C=N\NC(N)=N)cc1
Show InChI InChI=1S/C11H16N4.ClH/c1-8(2)10-5-3-9(4-6-10)7-14-15-11(12)13;/h3-8H,1-2H3,(H4,12,13,15);1H/b14-7+;
n/an/a 6.03E+3n/an/an/an/an/an/a
University of Kentucky
Curated by ChEMBL
Assay Description
Displacement of [3H]MK-801 from NMDA receptor complex (unknown origin) after 40 mins
Bioorg Med Chem 21: 1764-74 (2013)
Article DOI: 10.1016/j.bmc.2013.01.051
BindingDB Entry DOI: 10.7270/Q2M048CZ
Heme oxygenase
(Pseudomonas aeruginosa)
BDBM50191303
(Amino(2-(4-Isopropylbenzylidene)Hydrazinyl)Methani...)
Show SMILES Cl.CC(C)c1ccc(\C=N\NC(N)=N)cc1
Show InChI InChI=1S/C11H16N4.ClH/c1-8(2)10-5-3-9(4-6-10)7-14-15-11(12)13;/h3-8H,1-2H3,(H4,12,13,15);1H/b14-7+;
n/an/an/a 5.70E+3n/an/an/an/an/a
University of Maryland
Curated by ChEMBL
Assay Description
Binding affinity to Pseudomonas aeruginosa HemO by intrinsic fluorescence quenching method
J Med Chem 59: 6929-42 (2016)
BindingDB Entry DOI: 10.7270/Q26W9D18